{"text_format":"1","workbook":"xlsx","n_sheets":5,"sheets":["楽起 設置判定ツール","TAISﾘｽﾄ","S+Sﾁｪｯｸ表","S+Sﾁｪｯｸ関数","固定数値"],"not_rendered":{"charts":0,"images":13,"macros":1,"external_links":0,"defined_names":0,"comments":0,"pivot_tables":0},"unopened":[],"bounds":{"document_bytes":16777216,"sheet_cells":100000,"rows_first":2000,"rows_last":500,"rows_between":2000,"halvings":0,"cell_chars":16384,"cell_head_chars":4096},"cells_cut":0,"cells_raw":0,"read":"whole","date_system":"1900"}

{"sheet":"楽起 設置判定ツール","index":0,"n_rows":155,"n_cols":123,"rows_kept":155,"cut":false,"hidden":false,"merged":[[132,120,134,120],[132,121,134,121],[132,87,134,88],[132,111,134,111],[132,112,134,112],[132,113,134,113],[132,114,134,114],[132,115,134,115],[132,116,134,116],[132,117,134,117],[132,118,134,118],[132,119,134,119],[132,94,134,94],[132,95,134,95],[132,96,134,96],[132,97,134,97],[132,98,134,98],[95,110,97,110],[132,104,134,104],[132,105,134,105],[132,106,134,106],[132,107,134,107],[132,108,134,108],[132,109,134,109],[132,110,134,110],[98,95,102,95],[97,106,97,107],[97,100,97,101],[95,100,96,109],[111,94,111,95],[114,94,114,95],[97,108,97,109],[97,104,97,105],[97,102,97,103],[132,99,134,99],[132,100,134,100],[132,101,134,101],[132,102,134,102],[132,103,134,103],[114,101,114,102],[112,101,112,102],[149,79,151,79],[149,80,151,80],[149,81,151,81],[148,83,148,84],[147,83,147,84],[121,79,121,80],[115,79,115,80],[119,79,119,80],[118,79,118,80],[117,79,117,80],[5,32,5,35],[106,59,108,59],[106,58,108,58],[106,60,108,60],[106,61,108,61],[106,62,108,62],[106,63,108,63],[93,58,94,59],[95,58,96,59],[39,0,39,41],[40,41,54,41],[74,14,74,16],[40,5,40,6],[48,5,48,7],[50,8,50,9],[45,1,45,5],[69,23,69,25],[68,23,68,25],[69,15,69,20],[69,21,69,22],[51,23,52,26],[43,1,43,5],[40,1,40,4],[54,1,54,10],[147,75,147,76],[149,77,151,77],[149,78,151,78],[117,76,117,77],[128,66,128,67],[129,66,129,67],[119,43,120,43],[119,45,120,45],[144,66,144,67],[130,63,131,63],[136,57,137,57],[127,54,128,55],[132,57,134,57],[132,56,134,56],[132,58,134,58],[132,59,134,59],[113,87,113,88],[116,94,116,95],[111,87,111,88],[112,94,112,95],[132,44,134,44],[132,42,134,42],[144,75,144,76],[114,87,114,88],[127,87,127,88],[128,87,128,88],[129,87,129,88],[130,87,130,88],[131,87,131,88],[132,93,134,93],[132,89,134,89],[132,90,134,90],[132,91,134,91],[132,92,134,92],[76,25,76,28],[88,1,88,4],[82,0,82,41],[116,115,116,116],[111,115,111,116],[123,87,123,88],[124,87,124,88],[123,94,123,95],[124,94,124,95],[123,101,123,102],[124,101,124,102],[123,108,123,109],[124,108,124,109],[123,115,123,116],[124,115,124,116],[114,115,114,116],[112,115,112,116],[113,115,113,116],[113,101,113,102],[115,101,115,102],[116,87,116,88],[113,94,113,95],[115,94,115,95],[112,87,112,88],[99,3,99,4],[114,29,114,32],[93,5,93,7],[101,3,101,4],[75,13,75,17],[91,5,91,12],[91,21,91,28],[90,13,90,16],[86,5,86,24],[90,17,90,20],[83,0,83,41],[81,0,81,41],[90,1,90,4],[90,9,90,12],[90,25,90,28],[94,22,94,23],[96,8,96,9],[97,22,97,26],[101,1,101,2],[98,26,98,30],[79,11,79,20],[76,23,76,24],[95,1,95,4],[99,1,99,2],[121,21,121,25],[116,33,116,36],[117,21,117,28],[114,33,114,36],[116,9,116,12],[116,5,116,8],[105,17,105,24],[87,47,87,52],[93,22,93,23],[95,5,95,6],[100,19,100,22],[104,25,104,32],[97,48,97,49],[94,8,94,9],[111,47,111,52],[96,18,96,22],[100,14,100,17],[89,17,89,20],[94,24,94,26],[104,9,104,16],[107,0,107,41],[105,9,105,16],[104,17,104,24],[96,1,96,4],[25,5,25,7],[53,11,53,20],[71,9,71,10],[131,25,131,32],[131,33,131,40],[130,33,130,40],[130,25,130,32],[130,17,130,24],[109,0,109,41],[119,38,119,40],[128,35,128,36],[120,1,120,4],[120,5,120,6],[131,9,131,16],[114,25,114,28],[119,30,119,35],[116,29,116,32],[125,17,125,21],[119,18,119,23],[116,25,116,28],[127,30,127,33],[127,26,127,29],[126,26,126,29],[116,17,116,20],[73,3,73,4],[49,5,49,7],[45,11,45,15],[25,10,25,21],[28,10,28,21],[53,31,53,32],[54,31,54,32],[71,5,71,6],[69,5,69,6],[69,7,69,8],[71,1,71,4],[25,1,25,4],[37,0,37,41],[57,0,57,41],[33,5,33,7],[32,5,32,7],[32,9,32,11],[32,13,32,15],[32,17,32,19],[33,9,33,11],[33,13,33,15],[33,17,33,19],[41,5,41,24],[28,1,28,4],[12,1,14,3],[0,0,1,41],[138,1,138,2],[142,3,142,6],[138,3,138,6],[9,4,11,13],[2,0,2,40],[10,14,10,15],[9,1,11,3],[8,1,8,3],[8,4,8,40],[6,1,6,3],[6,4,6,40],[22,1,22,4],[15,1,15,3],[15,4,15,40],[12,4,12,40],[13,4,13,40],[40,7,40,40],[115,17,115,20],[56,0,56,41],[38,0,38,41],[58,0,58,41],[48,1,48,4],[17,1,17,3],[17,4,17,40],[99,14,99,17],[14,4,14,40],[18,1,18,3],[18,4,18,40],[19,1,19,3],[19,4,19,40],[65,21,65,25],[64,21,64,25],[63,21,63,25],[65,16,65,20],[64,16,64,20],[63,11,63,15],[63,16,63,20],[65,6,65,10],[65,1,65,5],[64,1,64,5],[63,1,63,5],[43,6,43,10],[16,4,16,40],[16,1,16,3],[21,0,21,19],[50,5,50,7],[128,37,128,40],[73,60,73,62],[85,5,85,6],[46,3,46,13],[102,28,102,29],[85,7,85,40],[60,7,60,40],[102,1,103,22],[95,8,95,9],[95,11,95,12],[102,30,102,33],[102,23,102,26],[78,11,78,20],[78,21,78,30],[66,14,66,22],[66,4,66,12],[62,1,62,25],[101,23,101,26],[101,19,101,22],[96,5,96,6],[96,11,96,12],[46,20,46,24],[117,13,117,20],[121,14,121,15],[142,13,142,21],[128,30,128,33],[120,14,120,15],[142,1,142,2],[143,13,143,22],[131,17,131,24],[120,8,120,9],[115,1,115,4],[121,5,121,6],[117,29,117,36],[119,1,119,4],[119,5,119,7],[115,13,115,16],[122,1,122,4],[130,1,130,8],[133,0,133,41],[121,1,121,4],[119,14,119,16],[134,0,134,41],[141,1,141,6],[126,22,126,25],[125,22,125,25],[116,21,116,24],[143,7,143,12],[141,7,141,12],[138,13,138,20],[138,7,138,10],[115,21,115,24],[137,1,137,16],[122,5,122,6],[122,8,122,9],[124,18,124,20],[121,8,121,9],[121,11,121,12],[119,11,119,13],[131,1,131,8],[122,11,122,12],[122,14,122,15],[120,11,120,12],[125,1,125,2],[126,1,126,2],[127,3,127,4],[126,3,126,4],[128,1,129,29],[115,29,115,32],[130,9,130,16],[119,8,119,10],[127,1,127,2],[148,1,148,2],[144,3,144,6],[143,3,143,6],[143,1,143,2],[144,13,144,21],[148,3,148,7],[147,1,147,7],[148,50,148,52],[148,47,148,49],[144,7,144,12],[153,1,153,7],[154,1,154,7],[148,8,148,10],[124,33,124,37],[123,29,123,33],[122,25,122,29],[153,8,153,20],[144,1,144,2],[154,8,154,20],[150,11,150,12],[149,11,149,12],[148,11,148,12],[147,8,147,12],[150,8,150,10],[149,8,149,10],[146,1,146,16],[138,11,138,12],[142,7,142,12],[140,1,140,16],[152,1,152,20],[150,3,150,7],[149,3,149,7],[150,1,150,2],[149,1,149,2],[119,24,119,25],[119,26,119,28],[119,36,119,37],[115,33,115,36],[96,48,96,49],[94,5,94,6],[115,25,115,28],[105,1,105,8],[111,1,111,4],[114,13,114,16],[112,5,112,24],[105,25,105,32],[115,9,115,12],[111,7,111,40],[111,5,111,6],[113,1,113,36],[114,1,114,4],[114,5,114,8],[114,17,114,20],[108,0,108,41],[114,21,114,24],[94,16,94,21],[104,1,104,8],[100,3,100,4],[7,4,7,40],[93,24,93,26],[50,16,50,18],[60,1,60,4],[50,1,50,4],[60,5,60,6],[68,5,68,8],[69,1,69,4],[64,6,64,10],[63,6,63,10],[65,11,65,15],[64,11,64,15],[68,9,68,12],[68,1,68,4],[25,8,25,9],[22,8,22,9],[68,15,68,20],[68,21,68,22],[28,5,28,7],[73,1,73,2],[88,5,88,8],[93,8,93,10],[93,11,93,13],[89,9,89,12],[75,1,75,2],[74,1,74,2],[91,13,91,20],[79,1,79,10],[85,1,85,4],[89,5,89,8],[90,5,90,8],[75,18,75,21],[75,3,75,4],[74,3,74,4],[90,21,90,24],[52,31,52,32],[42,17,42,22],[42,23,42,24],[42,25,42,27],[43,17,43,22],[43,23,43,24],[43,25,43,27],[72,22,72,26],[54,11,54,20],[71,17,71,21],[61,5,61,24],[51,17,52,19],[52,29,52,30],[53,29,53,30],[54,29,54,30],[42,1,42,15],[43,11,43,15],[22,5,22,7],[28,8,28,9],[53,1,53,10],[51,21,52,22],[22,10,22,21],[88,25,88,28],[89,21,89,24],[88,21,88,24],[89,25,89,28],[76,18,76,21],[79,21,79,30],[52,1,52,14],[44,11,44,15],[44,1,44,5],[45,6,45,10],[44,6,44,10],[71,7,71,8],[49,8,49,9],[49,1,49,4],[89,1,89,4],[88,9,88,12],[71,11,71,12],[70,1,70,4],[88,17,88,20],[32,1,33,4],[125,3,125,4],[122,67,122,69],[122,70,122,75],[89,13,89,16],[88,13,88,16],[93,16,93,21],[9,16,11,40],[64,47,64,52],[73,63,73,66],[78,1,78,10],[48,8,48,9],[94,1,94,4],[76,1,77,17],[94,11,94,12],[70,5,70,6],[70,7,70,8],[69,9,69,10],[69,11,69,12],[70,9,70,10],[70,11,70,12],[87,1,87,28],[93,1,93,4],[114,9,114,12],[117,5,117,12],[116,1,116,4],[115,5,115,8],[116,13,116,16],[100,1,100,2],[129,70,129,71],[128,70,128,71],[127,70,127,71],[94,95,94,99],[98,82,98,91],[99,82,99,83],[99,84,99,85],[99,86,99,87],[99,88,99,89],[99,90,99,91],[105,80,105,81],[95,99,97,99],[95,98,97,98],[95,97,97,97],[95,95,97,96],[112,79,112,80],[113,79,113,80],[114,79,114,80],[116,79,116,80],[106,81,110,86],[98,79,99,79],[116,101,116,102],[111,108,111,109],[114,108,114,109],[112,108,112,109],[113,108,113,109],[120,79,120,80],[100,64,104,64],[98,68,99,68],[98,67,99,67],[98,66,99,66],[99,69,99,70],[99,71,99,72],[99,73,99,74],[99,75,99,76],[99,77,99,78],[98,69,98,78],[98,80,99,80],[98,81,99,81],[103,98,103,99],[115,108,115,109],[116,108,116,109],[111,101,111,102],[6,43,6,44],[6,45,6,46],[7,43,7,46],[6,47,6,48],[6,49,6,50],[6,51,6,52],[7,47,7,52],[6,53,6,54],[18,48,18,49],[17,48,17,49],[16,48,16,49],[6,69,6,70],[7,61,7,70],[5,73,12,74],[6,55,6,56],[6,57,6,58],[6,59,6,60],[7,53,7,60],[6,61,6,62],[6,63,6,64],[6,65,6,66],[6,67,6,68],[36,43,39,48],[85,64,85,68],[85,61,85,63],[73,57,73,58],[20,48,20,49],[19,48,19,49],[52,57,52,59],[137,47,137,52],[52,55,52,56],[73,55,73,56],[47,55,47,59],[127,60,127,61],[135,62,135,63],[135,64,135,65],[121,65,121,66],[132,43,134,43],[130,66,130,67],[127,66,127,67],[106,64,108,64],[109,63,110,63],[109,64,110,64],[136,55,137,55],[105,67,105,68],[132,122,134,122],[132,73,134,73],[132,71,134,71],[132,72,134,72],[132,74,134,74],[132,75,134,75],[132,76,134,76],[106,89,110,91],[106,87,110,88],[106,92,110,93],[106,94,110,95],[106,96,110,98],[106,99,110,100],[106,101,110,102],[106,103,110,105],[106,106,110,107],[106,108,110,109],[106,110,110,112],[106,113,110,114],[106,115,110,116],[106,117,110,119],[106,120,110,121],[115,87,115,88],[115,115,115,116]]}
[null,null,null,null,null,null,null,null,null,null,null,null,null,null,null,null,null,null,null,null,null,null,null,null,null,null,null,null,null,null,null,null,null,null,null,null,null,null,null,null,null,null,null,{"$f":"AU53","v":"シングル"},{"$f":"IFERROR(INDEX($AR$1:$AR$6,SMALL(IF(AR$1:AR$6<>\"\",ROW(AR$1:AR$6),\"\"),ROW(AS1)-ROW(AS$1)+1)),\"\")","v":"シングル"},{"$f":"BD45","v":""},{"$f":"IFERROR(INDEX(AT$1:AT$5,SMALL(IF(AT$1:AT$5<>\"\",ROW(AT$1:AT$5),\"\"),ROW(AU1)-ROW(AU$1)+1)),\"\")","v":""},{"$f":"AS63","v":"シングル"},{"$f":"IFERROR(INDEX(AV$1:AV$5,SMALL(IF(AV$1:AV$5<>\"\",ROW(AV$1:AV$5),\"\"),ROW(AW1)-ROW(AW$1)+1)),\"\")","v":"シングル"},{"$f":"BJ67","v":""},{"$f":"IFERROR(INDEX(AX$1:AX$5,SMALL(IF(AX$1:AX$5<>\"\",ROW(AX$1:AX$5),\"\"),ROW(AY1)-ROW(AY$1)+1)),\"\")","v":""},{"$f":"BJ69","v":""},{"$f":"IFERROR(INDEX(AZ$1:AZ$5,SMALL(IF(AZ$1:AZ$5<>\"\",ROW(AZ$1:AZ$5),\"\"),ROW(BA1)-ROW(BA$1)+1)),\"\")","v":""},{"$f":"AS88","v":"シングル"},{"$f":"IFERROR(INDEX(BB$1:BB$5,SMALL(IF(BB$1:BB$5<>\"\",ROW(BB$1:BB$5),\"\"),ROW(BC1)-ROW(BC$1)+1)),\"\")","v":"シングル"},{"$f":"$BJ$89","v":""},{"$f":"IFERROR(INDEX(BD$1:BD$5,SMALL(IF(BD$1:BD$5<>\"\",ROW(BD$1:BD$5),\"\"),ROW(BE1)-ROW(BE$1)+1)),\"\")","v":""},{"$f":"$BJ$90","v":""},{"$f":"IFERROR(INDEX(BF$1:BF$5,SMALL(IF(BF$1:BF$5<>\"\",ROW(BF$1:BF$5),\"\"),ROW(BG1)-ROW(BG$1)+1)),\"\")","v":""},{"$f":"$BJ$91","v":""},{"$f":"IFERROR(INDEX(BH$1:BH$5,SMALL(IF(BH$1:BH$5<>\"\",ROW(BH$1:BH$5),\"\"),ROW(BI1)-ROW(BI$1)+1)),\"\")","v":""},{"$f":"AS114","v":"シングル"},{"$f":"IFERROR(INDEX(BJ$1:BJ$5,SMALL(IF(BJ$1:BJ$5<>\"\",ROW(BJ$1:BJ$5),\"\"),ROW(BK1)-ROW(BK$1)+1)),\"\")","v":"シングル"},{"$f":"$BJ$114","v":""},{"$f":"IFERROR(INDEX(BL$1:BL$5,SMALL(IF(BL$1:BL$5<>\"\",ROW(BL$1:BL$5),\"\"),ROW(BM1)-ROW(BM$1)+1)),\"\")","v":""},{"$f":"$BJ$115","v":""},{"$f":"IFERROR(INDEX(BN$1:BN$5,SMALL(IF(BN$1:BN$5<>\"\",ROW(BN$1:BN$5),\"\"),ROW(BO1)-ROW(BO$1)+1)),\"\")","v":""},{"$f":"$BJ$116","v":""},{"$f":"IFERROR(INDEX(BP$1:BP$5,SMALL(IF(BP$1:BP$5<>\"\",ROW(BP$1:BP$5),\"\"),ROW(BQ1)-ROW(BQ$1)+1)),\"\")","v":""},{"$f":"$BJ$117","v":""},{"$f":"IFERROR(INDEX(BR$1:BR$5,SMALL(IF(BR$1:BR$5<>\"\",ROW(BR$1:BR$5),\"\"),ROW(BS1)-ROW(BS$1)+1)),\"\")","v":""},null,null,{"$f":"$BK$144","v":""},{"$f":"IFERROR(INDEX(BV$1:BV$5,SMALL(IF(BV$1:BV$5<>\"\",ROW(BV$1:BV$5),\"\"),ROW(BW1)-ROW(BW$1)+1)),\"\")","v":""},{"$f":"BC141","v":""},{"$f":"IFERROR(INDEX(BX$1:BX$13,SMALL(IF(BX$1:BX$13<>\"\",ROW(BX$1:BX$13),\"\"),ROW(BY1)-ROW(BY$1)+1)),\"\")","v":""}]
[null,null,null,null,null,null,null,null,null,null,null,null,null,null,null,null,null,null,null,null,null,null,null,null,null,null,null,null,null,null,null,null,null,null,null,null,null,null,null,null,null,null,null,{"$f":"AU54","v":""},{"$f":"IFERROR(INDEX($AR$1:$AR$6,SMALL(IF(AR$1:AR$6<>\"\",ROW(AR$1:AR$6),\"\"),ROW(AS2)-ROW(AS$1)+1)),\"\")","v":"ロング"},{"$f":"BE45","v":""},{"$f":"IFERROR(INDEX(AT$1:AT$5,SMALL(IF(AT$1:AT$5<>\"\",ROW(AT$1:AT$5),\"\"),ROW(AU2)-ROW(AU$1)+1)),\"\")","v":""},{"$f":"AS64","v":""},{"$f":"IFERROR(INDEX(AV$1:AV$5,SMALL(IF(AV$1:AV$5<>\"\",ROW(AV$1:AV$5),\"\"),ROW(AW2)-ROW(AW$1)+1)),\"\")","v":"ロング"},{"$f":"BK67","v":""},{"$f":"IFERROR(INDEX(AX$1:AX$5,SMALL(IF(AX$1:AX$5<>\"\",ROW(AX$1:AX$5),\"\"),ROW(AY2)-ROW(AY$1)+1)),\"\")","v":""},{"$f":"BK69","v":""},{"$f":"IFERROR(INDEX(AZ$1:AZ$5,SMALL(IF(AZ$1:AZ$5<>\"\",ROW(AZ$1:AZ$5),\"\"),ROW(BA2)-ROW(BA$1)+1)),\"\")","v":""},{"$f":"AS89","v":""},{"$f":"IFERROR(INDEX(BB$1:BB$5,SMALL(IF(BB$1:BB$5<>\"\",ROW(BB$1:BB$5),\"\"),ROW(BC2)-ROW(BC$1)+1)),\"\")","v":"ロング"},{"$f":"$BK$89","v":""},{"$f":"IFERROR(INDEX(BD$1:BD$5,SMALL(IF(BD$1:BD$5<>\"\",ROW(BD$1:BD$5),\"\"),ROW(BE2)-ROW(BE$1)+1)),\"\")","v":""},{"$f":"$BK$90","v":""},{"$f":"IFERROR(INDEX(BF$1:BF$5,SMALL(IF(BF$1:BF$5<>\"\",ROW(BF$1:BF$5),\"\"),ROW(BG2)-ROW(BG$1)+1)),\"\")","v":""},{"$f":"$BK$91","v":""},{"$f":"IFERROR(INDEX(BH$1:BH$5,SMALL(IF(BH$1:BH$5<>\"\",ROW(BH$1:BH$5),\"\"),ROW(BI2)-ROW(BI$1)+1)),\"\")","v":""},{"$f":"AS115","v":""},{"$f":"IFERROR(INDEX(BJ$1:BJ$5,SMALL(IF(BJ$1:BJ$5<>\"\",ROW(BJ$1:BJ$5),\"\"),ROW(BK2)-ROW(BK$1)+1)),\"\")","v":"ロング"},{"$f":"$BK$114","v":""},{"$f":"IFERROR(INDEX(BL$1:BL$5,SMALL(IF(BL$1:BL$5<>\"\",ROW(BL$1:BL$5),\"\"),ROW(BM2)-ROW(BM$1)+1)),\"\")","v":""},{"$f":"$BK$115","v":""},{"$f":"IFERROR(INDEX(BN$1:BN$5,SMALL(IF(BN$1:BN$5<>\"\",ROW(BN$1:BN$5),\"\"),ROW(BO2)-ROW(BO$1)+1)),\"\")","v":""},{"$f":"$BK$116","v":""},{"$f":"IFERROR(INDEX(BP$1:BP$5,SMALL(IF(BP$1:BP$5<>\"\",ROW(BP$1:BP$5),\"\"),ROW(BQ2)-ROW(BQ$1)+1)),\"\")","v":""},{"$f":"$BK$117","v":""},{"$f":"IFERROR(INDEX(BR$1:BR$5,SMALL(IF(BR$1:BR$5<>\"\",ROW(BR$1:BR$5),\"\"),ROW(BS2)-ROW(BS$1)+1)),\"\")","v":""},null,null,{"$f":"$BL$144","v":""},{"$f":"IFERROR(INDEX(BV$1:BV$5,SMALL(IF(BV$1:BV$5<>\"\",ROW(BV$1:BV$5),\"\"),ROW(BW2)-ROW(BW$1)+1)),\"\")","v":""},{"$f":"BC142","v":""},{"$f":"IFERROR(INDEX(BX$1:BX$13,SMALL(IF(BX$1:BX$13<>\"\",ROW(BX$1:BX$13),\"\"),ROW(BY2)-ROW(BY$1)+1)),\"\")","v":""}]
["※設置判定はあくまでも計算上の結果で、実際の設置を保証するものではありませんのでご容赦ください。",null,null,null,null,null,null,null,null,null,null,null,null,null,null,null,null,null,null,null,null,null,null,null,null,null,null,null,null,null,null,null,null,null,null,null,null,null,null,null,null,null,null,{"$f":"AU55","v":"ロング"},{"$f":"IFERROR(INDEX($AR$1:$AR$6,SMALL(IF(AR$1:AR$6<>\"\",ROW(AR$1:AR$6),\"\"),ROW(AS3)-ROW(AS$1)+1)),\"\")","v":"スリム"},{"$f":"BF45","v":""},{"$f":"IFERROR(INDEX(AT$1:AT$5,SMALL(IF(AT$1:AT$5<>\"\",ROW(AT$1:AT$5),\"\"),ROW(AU3)-ROW(AU$1)+1)),\"\")","v":""},"ロング",{"$f":"IFERROR(INDEX(AV$1:AV$5,SMALL(IF(AV$1:AV$5<>\"\",ROW(AV$1:AV$5),\"\"),ROW(AW3)-ROW(AW$1)+1)),\"\")","v":"ショート"},{"$f":"BL67","v":""},{"$f":"IFERROR(INDEX(AX$1:AX$5,SMALL(IF(AX$1:AX$5<>\"\",ROW(AX$1:AX$5),\"\"),ROW(AY3)-ROW(AY$1)+1)),\"\")","v":""},{"$f":"BL69","v":""},{"$f":"IFERROR(INDEX(AZ$1:AZ$5,SMALL(IF(AZ$1:AZ$5<>\"\",ROW(AZ$1:AZ$5),\"\"),ROW(BA3)-ROW(BA$1)+1)),\"\")","v":""},{"$f":"AS90","v":"ロング"},{"$f":"IFERROR(INDEX(BB$1:BB$5,SMALL(IF(BB$1:BB$5<>\"\",ROW(BB$1:BB$5),\"\"),ROW(BC3)-ROW(BC$1)+1)),\"\")","v":"ショート"},{"$f":"$BL$89","v":""},{"$f":"IFERROR(INDEX(BD$1:BD$5,SMALL(IF(BD$1:BD$5<>\"\",ROW(BD$1:BD$5),\"\"),ROW(BE3)-ROW(BE$1)+1)),\"\")","v":""},{"$f":"$BL$90","v":""},{"$f":"IFERROR(INDEX(BF$1:BF$5,SMALL(IF(BF$1:BF$5<>\"\",ROW(BF$1:BF$5),\"\"),ROW(BG3)-ROW(BG$1)+1)),\"\")","v":""},{"$f":"$BL$91","v":""},{"$f":"IFERROR(INDEX(BH$1:BH$5,SMALL(IF(BH$1:BH$5<>\"\",ROW(BH$1:BH$5),\"\"),ROW(BI3)-ROW(BI$1)+1)),\"\")","v":""},"ロング",{"$f":"IFERROR(INDEX(BJ$1:BJ$5,SMALL(IF(BJ$1:BJ$5<>\"\",ROW(BJ$1:BJ$5),\"\"),ROW(BK3)-ROW(BK$1)+1)),\"\")","v":"ショート"},{"$f":"$BL$114","v":""},{"$f":"IFERROR(INDEX(BL$1:BL$5,SMALL(IF(BL$1:BL$5<>\"\",ROW(BL$1:BL$5),\"\"),ROW(BM3)-ROW(BM$1)+1)),\"\")","v":""},{"$f":"$BL$115","v":""},{"$f":"IFERROR(INDEX(BN$1:BN$5,SMALL(IF(BN$1:BN$5<>\"\",ROW(BN$1:BN$5),\"\"),ROW(BO3)-ROW(BO$1)+1)),\"\")","v":""},{"$f":"$BL$116","v":""},{"$f":"IFERROR(INDEX(BP$1:BP$5,SMALL(IF(BP$1:BP$5<>\"\",ROW(BP$1:BP$5),\"\"),ROW(BQ3)-ROW(BQ$1)+1)),\"\")","v":""},{"$f":"$BL$117","v":""},{"$f":"IFERROR(INDEX(BR$1:BR$5,SMALL(IF(BR$1:BR$5<>\"\",ROW(BR$1:BR$5),\"\"),ROW(BS3)-ROW(BS$1)+1)),\"\")","v":""},null,null,{"$f":"$BM$144","v":""},{"$f":"IFERROR(INDEX(BV$1:BV$5,SMALL(IF(BV$1:BV$5<>\"\",ROW(BV$1:BV$5),\"\"),ROW(BW3)-ROW(BW$1)+1)),\"\")","v":""},"",{"$f":"IFERROR(INDEX(BX$1:BX$13,SMALL(IF(BX$1:BX$13<>\"\",ROW(BX$1:BX$13),\"\"),ROW(BY3)-ROW(BY$1)+1)),\"\")","v":""}]
[null,null,null,null,null,null,null,null,null,null,null,null,null,null,null,null,null,null,null,null,null,null,null,null,null,null,null,null,null,null,null,null,null,null,null,null,null,null,null,null,null,null,null,{"$f":"AU57","v":"スリム"},{"$f":"IFERROR(INDEX($AR$1:$AR$6,SMALL(IF(AR$1:AR$6<>\"\",ROW(AR$1:AR$6),\"\"),ROW(AS4)-ROW(AS$1)+1)),\"\")","v":"ショート"},{"$f":"BG45","v":""},{"$f":"IFERROR(INDEX(AT$1:AT$5,SMALL(IF(AT$1:AT$5<>\"\",ROW(AT$1:AT$5),\"\"),ROW(AU4)-ROW(AU$1)+1)),\"\")","v":""},"ショート",{"$f":"IFERROR(INDEX(AV$1:AV$5,SMALL(IF(AV$1:AV$5<>\"\",ROW(AV$1:AV$5),\"\"),ROW(AW4)-ROW(AW$1)+1)),\"\")","v":""},{"$f":"BM67","v":""},{"$f":"IFERROR(INDEX(AX$1:AX$5,SMALL(IF(AX$1:AX$5<>\"\",ROW(AX$1:AX$5),\"\"),ROW(AY4)-ROW(AY$1)+1)),\"\")","v":""},{"$f":"BM69","v":""},{"$f":"IFERROR(INDEX(AZ$1:AZ$5,SMALL(IF(AZ$1:AZ$5<>\"\",ROW(AZ$1:AZ$5),\"\"),ROW(BA4)-ROW(BA$1)+1)),\"\")","v":""},{"$f":"AS91","v":"ショート"},{"$f":"IFERROR(INDEX(BB$1:BB$5,SMALL(IF(BB$1:BB$5<>\"\",ROW(BB$1:BB$5),\"\"),ROW(BC4)-ROW(BC$1)+1)),\"\")","v":""},{"$f":"$BM$89","v":""},{"$f":"IFERROR(INDEX(BD$1:BD$5,SMALL(IF(BD$1:BD$5<>\"\",ROW(BD$1:BD$5),\"\"),ROW(BE4)-ROW(BE$1)+1)),\"\")","v":""},{"$f":"$BM$90","v":""},{"$f":"IFERROR(INDEX(BF$1:BF$5,SMALL(IF(BF$1:BF$5<>\"\",ROW(BF$1:BF$5),\"\"),ROW(BG4)-ROW(BG$1)+1)),\"\")","v":""},{"$f":"$BM$91","v":""},{"$f":"IFERROR(INDEX(BH$1:BH$5,SMALL(IF(BH$1:BH$5<>\"\",ROW(BH$1:BH$5),\"\"),ROW(BI4)-ROW(BI$1)+1)),\"\")","v":""},"ショート",{"$f":"IFERROR(INDEX(BJ$1:BJ$5,SMALL(IF(BJ$1:BJ$5<>\"\",ROW(BJ$1:BJ$5),\"\"),ROW(BK4)-ROW(BK$1)+1)),\"\")","v":""},{"$f":"$BM$114","v":""},{"$f":"IFERROR(INDEX(BL$1:BL$5,SMALL(IF(BL$1:BL$5<>\"\",ROW(BL$1:BL$5),\"\"),ROW(BM4)-ROW(BM$1)+1)),\"\")","v":""},{"$f":"$BM$115","v":""},{"$f":"IFERROR(INDEX(BN$1:BN$5,SMALL(IF(BN$1:BN$5<>\"\",ROW(BN$1:BN$5),\"\"),ROW(BO4)-ROW(BO$1)+1)),\"\")","v":""},{"$f":"$BM$116","v":""},{"$f":"IFERROR(INDEX(BP$1:BP$5,SMALL(IF(BP$1:BP$5<>\"\",ROW(BP$1:BP$5),\"\"),ROW(BQ4)-ROW(BQ$1)+1)),\"\")","v":""},{"$f":"$BM$117","v":""},{"$f":"IFERROR(INDEX(BR$1:BR$5,SMALL(IF(BR$1:BR$5<>\"\",ROW(BR$1:BR$5),\"\"),ROW(BS4)-ROW(BS$1)+1)),\"\")","v":""},null,null,{"$f":"$BN$144","v":""},{"$f":"IFERROR(INDEX(BV$1:BV$5,SMALL(IF(BV$1:BV$5<>\"\",ROW(BV$1:BV$5),\"\"),ROW(BW4)-ROW(BW$1)+1)),\"\")","v":""},"",{"$f":"IFERROR(INDEX(BX$1:BX$13,SMALL(IF(BX$1:BX$13<>\"\",ROW(BX$1:BX$13),\"\"),ROW(BY4)-ROW(BY$1)+1)),\"\")","v":""}]
[null,null,null,null,null,null,null,null,null,null,null,null,null,null,null,null,null,null,null,null,null,null,null,null,null,null,null,null,null,null,null,null,null,null,null,null,null,null,null,null,null,null,null,{"$f":"AU60","v":"ショート"},{"$f":"IFERROR(INDEX($AR$1:$AR$6,SMALL(IF(AR$1:AR$6<>\"\",ROW(AR$1:AR$6),\"\"),ROW(AS5)-ROW(AS$1)+1)),\"\")","v":""},{"$f":"BH45","v":""},{"$f":"IFERROR(INDEX(AT$1:AT$5,SMALL(IF(AT$1:AT$5<>\"\",ROW(AT$1:AT$5),\"\"),ROW(AU5)-ROW(AU$1)+1)),\"\")","v":""},"",{"$f":"IFERROR(INDEX(AV$1:AV$5,SMALL(IF(AV$1:AV$5<>\"\",ROW(AV$1:AV$5),\"\"),ROW(AW5)-ROW(AW$1)+1)),\"\")","v":""},{"$f":"BN67","v":""},{"$f":"IFERROR(INDEX(AX$1:AX$5,SMALL(IF(AX$1:AX$5<>\"\",ROW(AX$1:AX$5),\"\"),ROW(AY5)-ROW(AY$1)+1)),\"\")","v":""},{"$f":"BN69","v":""},{"$f":"IFERROR(INDEX(AZ$1:AZ$5,SMALL(IF(AZ$1:AZ$5<>\"\",ROW(AZ$1:AZ$5),\"\"),ROW(BA5)-ROW(BA$1)+1)),\"\")","v":""},{"$f":"AS92","v":""},{"$f":"IFERROR(INDEX(BB$1:BB$5,SMALL(IF(BB$1:BB$5<>\"\",ROW(BB$1:BB$5),\"\"),ROW(BC5)-ROW(BC$1)+1)),\"\")","v":""},{"$f":"$BN$89","v":""},{"$f":"IFERROR(INDEX(BD$1:BD$5,SMALL(IF(BD$1:BD$5<>\"\",ROW(BD$1:BD$5),\"\"),ROW(BE5)-ROW(BE$1)+1)),\"\")","v":""},{"$f":"$BN$90","v":""},{"$f":"IFERROR(INDEX(BF$1:BF$5,SMALL(IF(BF$1:BF$5<>\"\",ROW(BF$1:BF$5),\"\"),ROW(BG5)-ROW(BG$1)+1)),\"\")","v":""},{"$f":"$BN$91","v":""},{"$f":"IFERROR(INDEX(BH$1:BH$5,SMALL(IF(BH$1:BH$5<>\"\",ROW(BH$1:BH$5),\"\"),ROW(BI5)-ROW(BI$1)+1)),\"\")","v":""},"",{"$f":"IFERROR(INDEX(BJ$1:BJ$5,SMALL(IF(BJ$1:BJ$5<>\"\",ROW(BJ$1:BJ$5),\"\"),ROW(BK5)-ROW(BK$1)+1)),\"\")","v":""},{"$f":"$BN$114","v":""},{"$f":"IFERROR(INDEX(BL$1:BL$5,SMALL(IF(BL$1:BL$5<>\"\",ROW(BL$1:BL$5),\"\"),ROW(BM5)-ROW(BM$1)+1)),\"\")","v":""},{"$f":"$BN$115","v":""},{"$f":"IFERROR(INDEX(BN$1:BN$5,SMALL(IF(BN$1:BN$5<>\"\",ROW(BN$1:BN$5),\"\"),ROW(BO5)-ROW(BO$1)+1)),\"\")","v":""},{"$f":"$BN$116","v":""},{"$f":"IFERROR(INDEX(BP$1:BP$5,SMALL(IF(BP$1:BP$5<>\"\",ROW(BP$1:BP$5),\"\"),ROW(BQ5)-ROW(BQ$1)+1)),\"\")","v":""},{"$f":"$BN$117","v":""},{"$f":"IFERROR(INDEX(BR$1:BR$5,SMALL(IF(BR$1:BR$5<>\"\",ROW(BR$1:BR$5),\"\"),ROW(BS5)-ROW(BS$1)+1)),\"\")","v":""},null,null,{"$f":"$BO$144","v":""},{"$f":"IFERROR(INDEX(BV$1:BV$5,SMALL(IF(BV$1:BV$5<>\"\",ROW(BV$1:BV$5),\"\"),ROW(BW5)-ROW(BW$1)+1)),\"\")","v":""},"",{"$f":"IFERROR(INDEX(BX$1:BX$13,SMALL(IF(BX$1:BX$13<>\"\",ROW(BX$1:BX$13),\"\"),ROW(BY5)-ROW(BY$1)+1)),\"\")","v":""}]
[null,"                                          ",null,null,null,null,null,null,null,null,null,null,null,null,null,null,null,null,null,null,null,null,null,null,null,null,null,null,null,null,null,null,"☝ジャンプ",null,null,null,null,null,null,null,null,null,null,{"$f":"AU61","v":""},{"$f":"IFERROR(INDEX($AR$1:$AR$6,SMALL(IF(AR$1:AR$6<>\"\",ROW(AR$1:AR$6),\"\"),ROW(AS6)-ROW(AS$1)+1)),\"\")","v":""},null,null,null,null,null,null,null,null,null,null,null,null,null,null,null,null,null,null,null,null,null,null,null,null,null,null,null,null,"判定ツール②",null,"",{"$f":"IFERROR(INDEX(BX$1:BX$13,SMALL(IF(BX$1:BX$13<>\"\",ROW(BX$1:BX$13),\"\"),ROW(BY6)-ROW(BY$1)+1)),\"\")","v":""}]
[null,"STEP１",null,null,"設置環境を入力してください。その際、小数点の無い整数で入力してください。",null,null,null,null,null,null,null,null,null,null,null,null,null,null,null,null,null,null,null,null,null,null,null,null,null,null,null,null,null,null,null,null,null,null,null,null,null,null,"下段",null,"連結",null,"下段",null,"連結①",null,"連結②",null,"下段",null,"連結①",null,"連結②",null,"連結③",null,"下段",null,"連結①",null,"連結②",null,"連結③",null,"連結④",null,null,null,null,null,"",{"$f":"IFERROR(INDEX(BX$1:BX$13,SMALL(IF(BX$1:BX$13<>\"\",ROW(BX$1:BX$13),\"\"),ROW(BY7)-ROW(BY$1)+1)),\"\")","v":""}]
[null,null,null,null,"段数：２段以上　蹴上：１～３０㎝まで　踏面：２８～５０㎝まで ※左記条件外の場合は 判定ツール② をお使いください。",null,null,null,null,null,null,null,null,null,null,null,null,null,null,null,null,null,null,null,null,null,null,null,null,null,null,null,null,null,null,null,null,null,null,null,null,null,null,"(A)プルダウンリスト",null,null,null,"(B)プルダウンリスト",null,null,null,null,null,"(C)プルダウンリスト",null,null,null,null,null,null,null,"(D)プルダウンリスト",null,null,null,null,null,null,null,null,null,null,null,null,null,"",{"$f":"IFERROR(INDEX(BX$1:BX$13,SMALL(IF(BX$1:BX$13<>\"\",ROW(BX$1:BX$13),\"\"),ROW(BY8)-ROW(BY$1)+1)),\"\")","v":""}]
[null,"STEP２",null,null,"(Ａ)～(Ｄ)４パターンより 設置判定 が 〇 と出たものをご確認ください。",null,null,null,null,null,null,null,null,null,null,null,null,null,null,null,null,null,null,null,null,null,null,null,null,null,null,null,null,null,null,null,null,null,null,null,null,null,null,null,null,null,null,null,null,null,null,null,null,null,null,null,null,null,null,null,null,null,null,null,null,null,null,null,null,null,null,null,null,null,null,"",{"$f":"IFERROR(INDEX(BX$1:BX$13,SMALL(IF(BX$1:BX$13<>\"\",ROW(BX$1:BX$13),\"\"),ROW(BY9)-ROW(BY$1)+1)),\"\")","v":""}]
[null,"STEP３",null,null,"【組み合わせシミュレーション】は",null,null,null,null,null,null,null,null,null,null,null," 部分の製品を選択できます。 表示に沿って商品を選択してください。",null,null,null,null,null,null,null,null,null,null,null,null,null,null,null,null,null,null,null,null,null,null,null,null,null,null,null,null,null,null,null,null,null,null,null,null,null,null,null,null,null,null,null,null,null,null,null,null,null,null,null,null,null,null,null,null,null,null,"",{"$f":"IFERROR(INDEX(BX$1:BX$13,SMALL(IF(BX$1:BX$13<>\"\",ROW(BX$1:BX$13),\"\"),ROW(BY10)-ROW(BY$1)+1)),\"\")","v":""}]
[null,null,null,null,null,null,null,null,null,null,null,null,null,null,null,null,null,null,null,null,null,null,null,null,null,null,null,null,null,null,null,null,null,null,null,null,null,null,null,null,null,null,null,null,null,null,null,null,null,null,null,null,null,null,null,null,null,null,null,null,null,null,null,null,null,null,null,null,null,null,null,null,null,null,null,"",{"$f":"IFERROR(INDEX(BX$1:BX$13,SMALL(IF(BX$1:BX$13<>\"\",ROW(BX$1:BX$13),\"\"),ROW(BY11)-ROW(BY$1)+1)),\"\")","v":""}]
[null,null,null,null,null,null,null,null,null,null,null,null,null,null,null,null,null,null,null,null,null,null,null,null,null,null,null,null,null,null,null,null,null,null,null,null,null,null,null,null,null,null,null,null,null,null,null,null,null,null,null,null,null,null,null,null,null,null,null,null,null,null,null,null,null,null,null,null,null,null,null,null,null,null,null,"",{"$f":"IFERROR(INDEX(BX$1:BX$13,SMALL(IF(BX$1:BX$13<>\"\",ROW(BX$1:BX$13),\"\"),ROW(BY12)-ROW(BY$1)+1)),\"\")","v":""}]
[null,null,null,null,"《楽起本体の選択に関して》",null,null,null,null,null,null,null,null,null,null,null,null,null,null,null,null,null,null,null,null,null,null,null,null,null,null,null,null,null,null,null,null,null,null,null,null,null,null,null,null,null,null,null,null,null,null,null,null,null,null,null,null,null,null,null,null,null,null,null,null,null,null,null,null,null,null,null,null,null,null,"",{"$f":"IFERROR(INDEX(BX$1:BX$13,SMALL(IF(BX$1:BX$13<>\"\",ROW(BX$1:BX$13),\"\"),ROW(BY13)-ROW(BY$1)+1)),\"\")","v":""}]
[null,null,null,null,"・初期設定では上段・下段は「シングル」が選択されています。製品を変更する場合は 上段→下段 の順で変更してください。"]
[null,null,null,null,"・中段の手すりを何段目に設置するかは製品名の上に表示されます。"]
[null,null,null,null,"《連結バーの選択に関して》"]
[null,null,null,null,"・連結バーは対応可能な製品が 「候補」 として表示されます。そちらを参考に選択してください。"]
[null,null,null,null,"・複数本連結バーを組み合わせる場合は 連結バー角度 を参考に近いものを選択してください。"]
[null,"STEP４",null,null,"上段必要スペース、下段必要スペース に出た数字に設置環境が対応しているかをご確認ください。"]
[null,"STEP５",null,null,"シミュレーション結果に基づいた該当品の TAISコード をご確認いただけます。"]
[]
["●設置環境を入力　※小数点の無い整数で入力してください"]
[null,"段　数",null,null,null,null,null,null,"段",null,{"$f":"IF(F23=\"\",\"※２段以上\",\"\")","v":"※２段以上"}]
[]
[]
[null,"蹴　上",null,null,null,null,null,null,"cm",null,{"$f":"IF(F26=\"\",\"※１㎝～３０㎝以内\",\"\")","v":"※１㎝～３０㎝以内"}]
[]
[]
[null,"踏　面",null,null,null,null,null,null,"cm",null,{"$f":"IF(F29=\"\",\"※２８㎝～５０㎝以内\",\"\")","v":"※２８㎝～５０㎝以内"}]
[]
[]
[null,"※下記（Ａ）～（Ｄ）をクリックすると該当箇所にジャンプします。"]
[]
[null,null,null,null,null,{"$f":"F41","v":""},null,null,null,{"$f":"F61","v":""},null,null,null,{"$f":"F86","v":""},null,null,null,{"$f":"F112","v":""}]
[]
[]
[null,null,null,null,null,null,null,null,null,null,null,null,null,null,null,null,null,null,null,null,null,null,null,null,null,null,null,null,null,null,null,null,null,null,null,null,null,null,null,null,null,null,null,"【Ａ 踏面に手すり設置ナシ】必要数値"]
[]
[]
[]
[null,null,null,null,null,{"$f":"IFERROR(IF(OR(F23=\"\",F26=\"\",F29=\"\"),\"\",IF(AND(F48=\"×\",G48=\"〇\"),\"△\",IF(AND(L48=\"×\",G48=\"〇\"),\"△\",IF(N48=\"△\",\"△\",IF(COUNTIFS(AC42:AF45,\"*×*\")>0,\"×\",\"〇\"))))),\"\")","v":""},null,null,null,null,null,null,null,null,null,null,null,null,null,null,null,null,null,null,null,null,null,null,null,null,null,null,null,null,null,null,null,null,null,null,null,null,null,null,"⑤ﾍﾞｰｽ端から芯","①斜辺","④支柱間距離","ベースサイズ","連結バー角度"]
[null,{"$f":"IF(OR($F$23=\"\",$F$26=\"\",$F$29=\"\"),\"\",\"〇\")","v":""},null,null,null,{"$f":"IF(F41=\"△\",\"※一部製品を変更すると設置可能です。対象品は緑で表示されております。\",\"\")","v":""},null,null,null,null,null,null,null,null,null,null,null,null,null,null,null,null,null,null,null,null,null,null,{"$f":"IF(B46=\"\",\"○\",IF(B46=\"手すりを選択\",\"△\",\"×\"))","v":"○"},{"$f":"IF(L46=\"\",\"○\",IF(L46=\"手すりを選択\",\"△\",\"×\"))","v":"○"},{"$f":"IF(D47=\"ナシ\",\"×\",\"〇\")","v":"〇"},null,null,null,null,null,null,null,null,null,null,null,null,"リ①",{"$f":"IF(ISBLANK(B45),\"△\",VLOOKUP(B45,固定数値!E:F,2,0))","v":10},"―","―",{"$f":"IF(ISBLANK(B45),\"△\",VLOOKUP(B45,固定数値!G:H,2,0))","v":49.5},"―"]
[null,"【組み合わせシミュレーション】",null,null,null,null,null,null,null,null,null,null,null,null,null,null,null,"上段 必要スペース",null,null,null,null,null,{"$f":"IFERROR(IF(OR(F23=\"\",F26=\"\",F29=\"\"),\"\",IF(G45=\"\",\"\",IF(AV42=\"△\",\"\",IF(AE45=\"×\",\"\",ROUNDUP(AV42,0))))),\"\")","v":""},null,"cm以上",null,null,{"$f":"IF($F$23=\"\",\"×\",IF(OR($F$23=0,$F$23=1),\"×\",\"〇\"))","v":"×"},{"$f":"IF($F$26=\"\",\"×\",IF(OR(F26<1,F26>30),\"×\",\"〇\"))","v":"×"},{"$f":"IF($F$29=\"\",\"×\",IF(OR(F29<28,F29>50),\"×\",IF(F29=0,\"×\",\"〇\")))","v":"×"},null,null,null,null,null,null,null,null,null,null,null,null,"連①","―",{"$f":"IF(ISBLANK(G45),\"△\",IF(G45=\"600\",\"48.5\",IF(G45=\"900\",\"78.5\",IF(G45=\"1200\",\"108.5\",IF(G45=\"ウェーブS\",\"95.904\",IF(G45=\"ウェーブ\",\"123.084\",\"\"))))))","v":"△"},{"$f":"((AT43^2-$F49^2)^0.5)+(7.99*2)","v":{"$error":"#VALUE!"}},"―",{"$f":"ASIN(F49/AT43)","v":{"$error":"#VALUE!"}}]
[null,"上段",null,null,null,null,"連結バー",null,null,null,null,"下段",null,null,null,null,null,"下段 必要スペース",null,null,null,null,null,{"$f":"IFERROR(IF(AV44=\"△\",\"\",IF(AE45=\"×\",\"\",IF(AS48-((AS51-1)*F29)+AV44>=AV44,ROUNDUP(AS48-((AS51-1)*F29)+AV44,0),\"×\"))),\"\")","v":""},null,"cm以上",null,null,{"$f":"IF(F26=\"\",\"△\",IF(F49<=72,\"〇\",\"×\"))","v":"△"},{"$f":"IFERROR(IF(AS47=\"△\",\"△\",IF(AS46<=AS47,\"〇\",\"×\")),\"E\")","v":"△"},{"$f":"IF(COUNTIFS(AV49:AV50,\"*×*\")>0,\"×\",\"〇\")","v":"×"},null,null,null,null,null,null,null,null,null,null,null,null,"リ②",{"$f":"IF(ISBLANK(L45),\"△\",VLOOKUP(L45,固定数値!E:F,2,0))","v":10},"―","―",{"$f":"IF(ISBLANK(L45),\"△\",VLOOKUP(L45,固定数値!G:H,2,0))","v":49.5},"―",null,null,null,null,null,"斜辺",48.5,78.5,108.5,95.903999999999996,123.084]
[null,"シングル",null,null,null,null,null,null,null,null,null,"シングル",null,null,null,null,null,null,null,null,null,null,null,null,null,null,null,null,{"$f":"IF(AV42=\"△\",\"△\",IF(X43=\"×\",\"×\",IF(X43>=AV42,\"〇\",\"×\")))","v":"〇"},{"$f":"IF(AV44=\"△\",\"△\",IF(X44=\"×\",\"×\",IF(X44>=AV44,\"〇\",\"×\")))","v":"〇"},{"$f":"IFERROR(IF(AS48<=AS46,\"×\",\"〇\"),\"E\")","v":"×"},null,null,null,null,null,null,null,null,null,null,null,null,null,null,null,null,null,null,null,null,null,null,null,"ﾌﾟﾙﾀﾞｳﾝﾘｽﾄ",{"$f":"IF(AX48=\"\",\"\",\"600\")","v":""},{"$f":"IF(AY48=\"\",\"\",\"900\")","v":""},{"$f":"IF(AZ48=\"\",\"\",\"1200\")","v":""},{"$f":"IF(BA48=\"\",\"\",\"ウェーブS\")","v":""},{"$f":"IF(BB48=\"\",\"\",\"ウェーブ\")","v":""}]
[null,{"$f":"IF(B45=\"\",\"手すりを選択\",\"\")","v":""},null,null,null,null,{"$f":"IF(B42=\"\",\"\",IF(G45=\"\",\"連結①を選択\",IF(AND(F48=\"×\",G48=\"〇\"),\"製品を変更\",\"\")))","v":""},null,null,null,null,{"$f":"IF(L45=\"\",\"手すりを選択\",IF(N48=\"△\",\"手すりを変更\",IF(AND(B45=\"ショートダブル\",BE55=\"S\"),\"ダブルに変更\",IF(AND(B45=\"ダブル\",BG55=\"\"),\"両手すりに変更\",IF(AND(BD55=\"S\",L45=\"ショートダブル\"),\"片手すり(大ベース)に変更\",IF(AND(BF55=\"\",BG55=\"D\"),\"片手すりに変更\",IF(AND(BD55=\"S\",BE55=\"S\"),\"大ベース製品に変更\",IF(AND(B45=\"ショートダブル\",BG55=\"\"),\"ダブルに変更\",\"\"))))))))","v":""},null,null,null,null,null,null,null,null,null,null,null,null,null,null,null,null,null,null,null,null,null,null,null,null,null,null,null,null,null,null,null,"最低ベース間距離",{"$f":"IF(F29=\"\",\"△\",($F$23-1)*$F$29)","v":"△"},null,"水平角度チェック",{"$f":"IF(F51=\"\",\"△\",COUNTIFS(F51,\">=\"&-7.014,F51,\"<=\"&7.014))","v":"△"},null,"☆600 ","☆900 ","☆1200 ","☆ウェーブS ","☆ウェーブ "]
[null,null,null,{"$f":"IF(B42=\"\",\"\",IF(AND(AX48=\"\",AY48=\"\",AZ48=\"\",BA48=\"\",BB48=\"\"),\"ナシ\",IF(COUNTIFS(AC43:AF44,\"*×*\")>0,\"ナシ\",AX48&AY48&AZ48&BA48&BB48)))","v":""},null,null,null,null,null,null,null,null,null,null,null,null,null,null,null,null,{"$f":"IF(G45=\"\",\"未選択\",G45)","v":"未選択"},null,null,null,null,null,null,null,null,null,null,null,null,null,null,null,null,null,null,null,null,null,null,"必要最大ﾍﾞｰｽ間",{"$f":"IF(F49=\"\",\"△\",(((123.084^2-$F49^2)^0.5)+(7.99*2))-(10+7.5))","v":"△"},null,"(F)40°以上×",{"$f":"IF(F50=\"\",\"△\",IF(F50<=40.2,\"〇\",\"×\"))","v":"△"},null,30,50,70,"35~55","47~72"]
[null,null,null,null,null,{"$f":"IF(G45=\"\",\"〇\",IF(COUNTIF(BD45:BH45,G45)=0,\"×\",\"〇\"))","v":"〇"},{"$f":"IF(D47=\"ナシ\",\"×\",\"〇\")","v":"〇"},null,null,null,{"$f":"IF($F$23=\"\",\"×\",\"\")","v":"×"},{"$f":"IF(OR(L46=\"\",L46=\"手すりを選択\"),\"〇\",\"×\")","v":"〇"},{"$f":"IF($F$29=\"\",\"×\",\"\")","v":"×"},{"$f":"IF(AND(COUNTIFS(AS53:AS62,\"〇\")>0,AR53=\"×\"),\"△\",\"\")","v":""},null,null,null,null,null,null,null,null,null,null,null,null,null,null,null,null,null,null,null,null,null,null,null,null,null,null,null,null,null,"ベース間距離",{"$f":"IFERROR($AU$43-($AS$42+$AS$44),\"\")","v":""},null,"(G)-7.01～7.01°",{"$f":"IF(OR(AV46=1,AV46=\"△\"),\"〇\",\"×\")","v":"〇"},"連結１",{"$f":"IFERROR(IF(AX49<=$AS$46,\"\",IF($F$49<=AX47,AX46,\"\")),\"\")","v":""},{"$f":"IFERROR(IF(AY49<=$AS$46,\"\",IF($F$49<=AY47,AY46,\"\")),\"\")","v":""},{"$f":"IFERROR(IF(AZ49<=$AS$46,\"\",IF($F$49<=AZ47,AZ46,\"\")),\"\")","v":""},{"$f":"IFERROR(IF(BA49<=$AS$46,\"\",IF($F$49>=55,\"\",IF($F$49>=35,BA46,\"\"))),\"\")","v":""},{"$f":"IFERROR(IF(BB49<=$AS$46,\"\",IF($F$49>=72,\"\",IF($F$49>=47,BB46,\"\"))),\"\")","v":""},null,"連結バー候補：下段スリムの場合"]
[null,"段　差",null,null,null,{"$f":"IF(COUNTIFS(AC43:AE43,\"*×*\")>0,\"\",IF(F26=\"\",\"\",$F$23*$F$26))","v":""},null,null,"cm",null,null,null,null,null,null,null,null,null,null,null,null,null,null,null,null,null,null,null,null,null,null,null,null,null,null,null,null,null,null,null,null,null,null,"最小斜辺",{"$f":"( AS50^2 +F49^2)^0.5","v":{"$error":"#VALUE!"}},null,"必要スペース",{"$f":"AC45","v":"〇"},"ｱ)ﾍﾞｰｽ間距離",{"$f":"IFERROR(IF(OR($AS$42=\"△\",$AS$44=\"△\"),((BD44^2-$F$49^2)^0.5)+(7.99*2)-(10+7.5),((BD44^2-$F$49^2)^0.5)+(7.99*2)-($AS$42+$AS$44)),\"E\")","v":"E"},{"$f":"IFERROR(IF(OR($AS$42=\"△\",$AS$44=\"△\"),((BE44^2-$F$49^2)^0.5)+(7.99*2)-(10+7.5),((BE44^2-$F$49^2)^0.5)+(7.99*2)-($AS$42+$AS$44)),\"E\")","v":"E"},{"$f":"IFERROR(IF(OR($AS$42=\"△\",$AS$44=\"△\"),((BF44^2-$F$49^2)^0.5)+(7.99*2)-(10+7.5),((BF44^2-$F$49^2)^0.5)+(7.99*2)-($AS$42+$AS$44)),\"E\")","v":"E"},{"$f":"IFERROR(IF(OR($AS$42=\"△\",$AS$44=\"△\"),((BG44^2-$F$49^2)^0.5)+(7.99*2)-(10+7.5),((BG44^2-$F$49^2)^0.5)+(7.99*2)-($AS$42+$AS$44)),\"E\")","v":"E"},{"$f":"IFERROR(IF(OR($AS$42=\"△\",$AS$44=\"△\"),((BH44^2-$F$49^2)^0.5)+(7.99*2)-(10+7.5),((BH44^2-$F$49^2)^0.5)+(7.99*2)-($AS$42+$AS$44)),\"E\")","v":"E"},null,{"$f":"IFERROR(IF(BD50<=$AS$46,\"\",IF($F$49<=AX47,AX46,\"\")),\"\")","v":""},{"$f":"IFERROR(IF(BE50<=$AS$46,\"\",IF($F$49<=AY47,AY46,\"\")),\"\")","v":""},{"$f":"IFERROR(IF(BF50<=$AS$46,\"\",IF($F$49<=AZ47,AZ46,\"\")),\"\")","v":""},{"$f":"IFERROR(IF(BG50<=$AS$46,\"\",IF($F$49>=55,\"\",IF($F$49>=35,BA46,\"\"))),\"\")","v":""},{"$f":"IFERROR(IF(BH50<=$AS$46,\"\",IF($F$49>=72,\"\",IF($F$49>=47,BB46,\"\"))),\"\")","v":""}]
[null,"連結バー角度",null,null,null,{"$f":"IFERROR(IF(G45=\"\",\"\",AW43*180/PI()),\"\")","v":""},null,null,"°",null,null,null,null,null,null,null,null,null,null,null,null,null,null,null,null,null,null,null,null,null,null,null,null,null,null,null,null,null,null,null,null,null,null,"最小底辺",{"$f":"(AS46+AS42+AS44)-(7.99*2)","v":{"$error":"#VALUE!"}},null,"(A)72cm以下",{"$f":"IF(F49<=72,\"〇\",\"×\")","v":"×"},null,null,null,null,null,null,null,{"$f":"IFERROR(((BD44^2-$F$49^2)^0.5)+(7.99*2)-(10+7.5),\"E\")","v":"E"},{"$f":"IFERROR(((BE44^2-$F$49^2)^0.5)+(7.99*2)-(10+7.5),\"E\")","v":"E"},{"$f":"IFERROR(((BF44^2-$F$49^2)^0.5)+(7.99*2)-(10+7.5),\"E\")","v":"E"},{"$f":"IFERROR(((BG44^2-$F$49^2)^0.5)+(7.99*2)-(10+7.5),\"E\")","v":"E"},{"$f":"IFERROR(((BH44^2-$F$49^2)^0.5)+(7.99*2)-(10+7.5),\"E\")","v":"E"}]
[null,"水平部分角度",null,null,null,{"$f":"IFERROR(IF(G45=\"ウェーブ\",F50-29.22,IF(G45=\"ウェーブS\",F50-27.98,\"\")),\"\")","v":""},null,null,"°",null,null,null,null,null,null,null,"上段",null,null,null,null,null,null,null,null,null,null,null,null,null,null,null,null,null,null,null,null,null,null,null,null,null,null,"段数",{"$f":"F23","v":0},null,null,{"$f":"IF(G45=\"\",\"△\",IF(COUNTIFS(AV47:AV49,\"*×*\")>0,\"×\",\"〇\"))","v":"△"}]
[null,null,null,null,null,null,null,null,null,null,{"$f":"IF($F$23=\"\",\"×\",\"\")","v":"×"},{"$f":"IF($F$26=\"\",\"×\",\"\")","v":"×"},{"$f":"IF($F$29=\"\",\"×\",\"\")","v":"×"},null,null,null,null,{"$f":"IF(B45=\"\",\"未選択\",B45)","v":"シングル"},null,null,null,"下段",null,{"$f":"IF(L45=\"\",\"未選択\",IF(L46=\"ショート不可\",\"不可\",IF(L46=\"スリム不可\",\"不可\",L45)))","v":"シングル"}]
[null,"【シミュレーション結果の各種TAISコード】",null,null,null,null,null,null,null,null,null,null,null,null,null,null,null,null,null,null,null,null,null,null,null,null,null,null,null,"段　数",null,{"$f":"$F$23","v":0},null,"段",null,null,null,null,null,null,null,null,null,{"$f":"IF(L45=\"\",\"\",INDEX(AS53:AT61,MATCH(L45,AT53:AT61,0),1))","v":0},null,"シングル",{"$f":"IF(AS53=\"×\",\"\",IF(OR(B45=AT53,B45=AT55,B45=AT60),AT53,\"\"))","v":"シングル"},{"$f":"IF(AU53<>\"\",ROW(AU53),\"\")","v":53},1,{"$f":"INDEX($AU$53:$AU$61,SMALL(IF(AU$53:AU$61<>\"\",ROW(AU$53:AU$61),\"\"),AW53))","v":{"$error":"#REF!"}},null,null,null,null,null,"ショート判定",null,"ダブル判定"]
[null,{"$f":"IF(OR(F41=\"×\",F41=\"\",F41=\"△\",G45=\"\"),\"\",IF(L45=\"スリム\",B45&\"＋スリム＋連結バー\"&G45&\"セット\",IF(OR(B45=\"\",G45=\"\"),\"\",IF(OR(B45=\"ダブル\",B45=\"ショートダブル\"),B45&\"＋連結バー\"&G45&\" 2本セット\",B45&\"+連結バー\"&G45&\" セット\"))))","v":""},null,null,null,null,null,null,null,null,null,{"$f":"IF(OR(F41=\"×\",F41=\"\",F41=\"△\",G45=\"\"),\"\",IF(L45=\"スリム\",\"\",IF(L45=\"\",\"\",L45&\" ※単体\")))","v":""},null,null,null,null,null,null,null,null,null,null,null,null,null,null,null,null,null,"蹴　上",null,{"$f":"$F$26","v":0},null,"㎝",null,null,null,null,null,null,null,null,null,null,{"$f":"IFERROR(IF(($AU$43-($AS$42+10))<=AS46,\"×\",\"〇\"),\"E\")","v":"E"},"ダブル",{"$f":"IF(AS54=\"×\",\"\",IF(OR(B45=AT54,B45=AT61),AT54,\"\"))","v":""},{"$f":"IF(AU54<>\"\",ROW(AU54),\"\")","v":""},2,{"$f":"INDEX($AU$53:$AU$61,SMALL(IF(AU$53:AU$61<>\"\",ROW(AU$53:AU$61),\"\"),AW54))","v":{"$error":"#REF!"}},null,null,null,null,null,"上段","下段","上段","下段","チェック"]
[null,{"$f":"IFERROR(IF(OR(F41=\"×\",F41=\"\",F41=\"△\",G45=\"\"),\"\",IF(L45=\"スリム\",INDEX(TAISﾘｽﾄ!H3:L19,MATCH(B45,TAISﾘｽﾄ!A3:A19,0),MATCH(G45,TAISﾘｽﾄ!H2:L2,0)),INDEX(TAISﾘｽﾄ!B3:L19,MATCH(B45,TAISﾘｽﾄ!A3:A19,0),MATCH(G45,TAISﾘｽﾄ!B2:L2,0)))),\"E\")","v":""},null,null,null,null,null,null,null,null,null,{"$f":"IFERROR(IF(OR(F41=\"×\",F41=\"\",F41=\"△\",G45=\"\"),\"\",INDEX(TAISﾘｽﾄ!B3:B19,MATCH(L45,TAISﾘｽﾄ!A3:A19,0))),\"\")","v":""},null,null,null,null,null,null,null,null,null,null,null,null,null,null,null,null,null,"踏　面",null,{"$f":"$F$29","v":0},null,"㎝",null,null,null,null,null,null,null,null,null,null,null,"ロング",{"$f":"IF(AS55=\"×\",\"\",IF(OR(B45=AT53,B45=AT55,B45=AT60),AT55,\"\"))","v":"ロング"},55,3,{"$f":"INDEX($AU$53:$AU$61,SMALL(IF(AU$53:AU$61<>\"\",ROW(AU$53:AU$61),\"\"),AW55))","v":{"$error":"#REF!"}},null,null,null,null,null,{"$f":"IF(B45=\"ショート\",\"S\",IF(B45=\"ショートダブル\",\"S\",\"\"))","v":""},{"$f":"IF(L45=\"ショート\",\"S\",IF(L45=\"ショートダブル\",\"S\",IF(L45=\"スリム\",\"S\",\"\")))","v":""},{"$f":"IF(OR(B45=\"ダブル\",B45=\"ショートダブル\"),\"D\",\"\")","v":""},{"$f":"IF(OR(L45=\"ダブル\",L45=\"ショートダブル\"),\"D\",\"\")","v":""},{"$f":"COUNTIFS(BF55:BG55,\"D\")","v":0}]
[null,null,null,null,null,null,null,null,null,null,null,null,null,null,null,null,null,null,null,null,null,null,null,null,null,null,null,null,null,null,null,null,null,null,null,null,null,null,null,null,null,null,null,null,null,null,null,"",4,{"$f":"INDEX($AU$53:$AU$61,SMALL(IF(AU$53:AU$61<>\"\",ROW(AU$53:AU$61),\"\"),AW56))","v":{"$error":"#REF!"}}]
[null,null,null,null,null,null,null,null,null,null,null,null,null,null,null,null,null,null,null,null,null,null,null,null,null,null,null,null,null,null,null,null,null,null,null,null,null,null,null,null,null,null,null,null,{"$f":"IFERROR(IF(($AU$43-($AS$42+15.25))<=AS46,\"×\",\"〇\"),\"E\")","v":"E"},"スリム",{"$f":"IF(AS57=\"×\",\"\",IF(OR(B45=AT53,B45=AT55,),AT57,\"\"))","v":"スリム"},57,5,{"$f":"INDEX($AU$53:$AU$61,SMALL(IF(AU$53:AU$61<>\"\",ROW(AU$53:AU$61),\"\"),AW57))","v":{"$error":"#NUM!"}}]
[null,null,null,null,null,null,null,null,null,null,null,null,null,null,null,null,null,null,null,null,null,null,null,null,null,null,null,null,null,null,null,null,null,null,null,null,null,null,null,null,null,null,null,null,null,null,null,"",6,{"$f":"INDEX($AU$53:$AU$61,SMALL(IF(AU$53:AU$61<>\"\",ROW(AU$53:AU$61),\"\"),AW58))","v":{"$error":"#NUM!"}}]
[null,null,null,null,null,null,null,null,null,null,null,null,null,null,null,null,null,null,null,null,null,null,null,null,null,null,null,null,null,null,null,null,null,null,null,null,null,null,null,null,null,null,null,null,null,null,null,"",7,{"$f":"INDEX($AU$53:$AU$61,SMALL(IF(AU$53:AU$61<>\"\",ROW(AU$53:AU$61),\"\"),AW59))","v":{"$error":"#NUM!"}}]
[null,null,null,null,null,null,null,null,null,null,null,null,null,null,null,null,null,null,null,null,null,null,null,null,null,null,null,null,null,null,null,null,null,null,null,null,null,null,null,null,null,null,null,null,null,"ショート",{"$f":"IF(AS60=\"×\",\"\",IF(OR(B45=AT53,B45=AT55),AT60,\"\"))","v":"ショート"},60,8,{"$f":"INDEX($AU$53:$AU$61,SMALL(IF(AU$53:AU$61<>\"\",ROW(AU$53:AU$61),\"\"),AW60))","v":{"$error":"#NUM!"}}]
[null,null,null,null,null,{"$f":"IFERROR(IF(OR(F23=\"\",F26=\"\",F29=\"\"),\"\",IF(AND(D62=\"×\",E62=\"〇\"),\"△\",IF(AND(C62=\"×\",E62=\"〇\"),\"△\",IF(COUNTIFS(AA62:AD66,\"*×*\")>0,\"×\",\"〇\")))),\"\")","v":""},null,null,null,null,null,null,null,null,null,null,null,null,null,null,null,null,null,null,null,null,null,null,null,null,null,null,null,null,null,null,null,null,null,null,null,null,null,null,{"$f":"IFERROR(IF(($AU$43-($AS$42+7.5))<=AS46,\"×\",\"〇\"),\"E\")","v":"E"},"ショートダブル",{"$f":"IF(AS61=\"×\",\"\",IF(B45=AT54,AT61,\"\"))","v":""},"",9,{"$f":"INDEX($AU$53:$AU$61,SMALL(IF(AU$53:AU$61<>\"\",ROW(AU$53:AU$61),\"\"),AW61))","v":{"$error":"#NUM!"}}]
[null,{"$f":"IF(OR($F$23=\"\",$F$26=\"\",$F$29=\"\"),\"\",\"〇\")","v":""},{"$f":"IF(OR(L68=\"×\",V68=\"×\"),\"×\",\"〇\")","v":"〇"},{"$f":"IF(OR(F68=\"×\",P68=\"×\"),\"×\",\"〇\")","v":"〇"},{"$f":"IF(AND(G68=\"〇\",Q68=\"〇\"),\"〇\",\"×\")","v":"〇"},{"$f":"IF(F61=\"△\",\"※一部製品を変更すると設置可能です。対象品は緑で表示されております。\",\"\")","v":""},null,null,null,null,null,null,null,null,null,null,null,null,null,null,null,null,null,null,null,null,{"$f":"IF(E67=\"ナシ\",\"×\",\"〇\")","v":"〇"},{"$f":"IF(O67=\"ナシ\",\"×\",\"〇\")","v":"〇"},{"$f":"IF(COUNTIFS(B66:Z66,\"*×*\")>0,\"×\",\"〇\")","v":"〇"},null,null,null,null,null,null,null,null,null,null,null,null,null,null,null,{"$f":"IF(COUNTIFS(BD49:BH49,\"\")=5,\"×\",\"〇\")","v":"×"},"連結バー候補"]
[null,"【組み合わせシミュレーション】",null,null,null,null,null,null,null,null,null,null,null,null,null,null,null,null,null,null,null,null,null,null,null,null,{"$f":"IF(B66=\"\",\"〇\",IF(B66=\"手すりを選択\",\"△\",\"×\"))","v":"〇"},{"$f":"IF(L66=\"\",\"〇\",IF(L66=\"手すりを選択\",\"△\",\"×\"))","v":"〇"},{"$f":"IF(V66=\"\",\"〇\",IF(V66=\"手すりを選択\",\"△\",\"×\"))","v":"〇"},null,null,null,null,null,null,null,null,null,null,null,null,null,null,"シングル",{"$f":"IF(OR(B65=AR63,B65=AR65,B65=AR66),AR63,\"\")","v":"シングル"},{"$f":"IFERROR(INDEX(AS63:AS67,SMALL(IF(AS$63:AS$67<>\"\",ROW(AS$63:AS$67),\"\"),ROW(AT63)-ROW(AT$63)+63)),\"\")","v":""}]
[null,"上段",null,null,null,null,"連結①",null,null,null,null,{"$f":"IFERROR(IF(B62=\"\",\"\",IF(COUNTIFS(AA64:AD65,\"*×*\")>0,\"×\",$F$23-AW80)),\"―\")","v":""},null,null,null,null,"連結②",null,null,null,null,"下段",null,null,null,null,{"$f":"IF($F$23=\"\",\"×\",IF(OR($F$23=0,$F$23=1),\"×\",\"〇\"))","v":"×"},{"$f":"IF($F$26=\"\",\"×\",IF(OR(F26<1,F26>30),\"×\",\"〇\"))","v":"×"},{"$f":"IF($F$29=\"\",\"×\",IF(OR(F29<28,F29>50),\"×\",IF(F29=0,\"×\",\"〇\")))","v":"×"},null,null,null,null,null,null,null,null,null,null,null,null,null,null,"ダブル",{"$f":"IF(OR(B65=AR64,B65=AR67),AR64,\"\")","v":""},null,null,null,null,null,null,null,null,null,"斜辺",48.5,78.5,95.903999999999996,108.5,123.084]
[null,"シングル",null,null,null,null,null,null,null,null,null,{"$f":"IF(OR(B65=\"ダブル\",B65=\"ショートダブル\"),\"ショートダブル\",\"ショート\")","v":"ショート"},null,null,null,null,null,null,null,null,null,"シングル",null,null,null,null,{"$f":"IF(COUNTIFS(AW80:AX80,\"*×*\")>0,\"×\",\"〇\")","v":"×"},{"$f":"IF(COUNTIFS(BA79:BB79,\"*×*\")>0,\"×\",\"〇\")","v":"〇"},{"$f":"IFERROR(IF(AW76=\"△\",\"△\",IF(AW75<=AW76,\"〇\",\"×\")),\"E\")","v":"△"},{"$f":"IFERROR(IF(AX76=\"△\",\"△\",IF(AX75<=AX76,\"〇\",\"×\")),\"E\")","v":"△"},null,null,null,null,null,null,null,null,null,null,null,null,null,"ロング",{"$f":"IF(OR(B65=AR63,B65=AR65,B65=AR66),AR65,\"\")","v":"ロング"},null,null,"【Ｂ 踏面に手すり１台設置】必要数値",null,null,null,null,null,null,null,"☆600 ","☆900 ","☆ウェーブS ","☆1200 ","☆ウェーブ "]
[null,{"$f":"IF(B65=\"\",\"手すりを選択\",\"\")","v":""},null,null,null,null,{"$f":"IF(B62=\"\",\"\",IF(G65=\"\",\"連結①を選択\",IF(AND(D62=\"×\",E62=\"〇\",F68=\"×\",G68=\"〇\"),\"製品を変更\",\"\")))","v":""},null,null,null,null,null,null,null,null,null,{"$f":"IF(B62=\"\",\"\",IF(Q65=\"\",\"連結②を選択\",IF(AND(D62=\"×\",E62=\"〇\",P68=\"×\",Q68=\"〇\"),\"製品を変更\",\"\")))","v":""},null,null,null,null,{"$f":"IF(V65=\"\",\"手すりを選択\",IF(AND(B65=\"ショートダブル\",BJ76=\"S\"),\"ダブルに変更\",IF(AND(B65=\"ダブル\",BN76=\"\"),\"両手すりに変更\",IF(AND(BI76=\"S\",V65=\"ショートダブル\"),\"片手すり(大ベース)に変更\",IF(AND(BL76=\"\",BN76=\"D\"),\"片手すりに変更\",IF(AND(BI76=\"S\",BJ76=\"S\"),\"大ベース製品に変更\",IF(AND(B45=\"ショートダブル\",BG55=\"\"),\"ダブルに変更\",\"\")))))))","v":""},null,null,null,null,{"$f":"IF(AZ67=\"△\",\"△\",IF(V69=\"×\",\"×\",IF(AZ67<=V69,\"〇\",\"×\")))","v":"〇"},{"$f":"IF(AZ71=\"△\",\"△\",IF(V70=\"×\",\"×\",IF(AZ71<=V70,\"〇\",\"×\")))","v":"〇"},{"$f":"IF(COUNTIFS(AZ80:BB80,\"*×*\")>0,\"×\",\"〇\")","v":"〇"},null,null,null,null,null,null,null,null,null,null,null,null,null,null,"ショート",{"$f":"IF(OR(B65=AR63,B65=AR65),AR66,\"\")","v":"ショート"},null,null,null,"⑤ﾍﾞｰｽ端から芯","①斜辺","④支柱間距離","ベースサイズ","連結バー角度",null,"段差",30,50,"35~55",70,"47~72"]
[null,null,null,null,{"$f":"IF(B62=\"\",\"\",IF(AND(BD67=\"\",BE67=\"\",BF67=\"\",BG67=\"\",BH67=\"\"),\"ナシ\",IF(COUNTIFS(AA64:AD65,\"×\")>0,\"ナシ\",BD67&BE67&BG67&BF67&BH67)))","v":""},null,null,null,null,null,null,null,null,null,{"$f":"IF(B62=\"\",\"\",IF(AND(BD69=\"\",BE69=\"\",BF69=\"\",BG69=\"\",BH69=\"\"),\"ナシ\",IF(COUNTIFS(AA64:AD65,\"×\")>0,\"ナシ\",BD69&BE69&BG69&BF69&BH69)))","v":""},null,null,null,null,null,null,null,null,null,null,null,null,null,null,null,null,null,null,null,null,null,null,null,null,null,null,null,null,"ショートダブル",{"$f":"IF(B65=AR64,AR67,\"\")","v":""},null,null,"リ①",{"$f":"IF(ISBLANK(B65),\"△\",VLOOKUP(B65,固定数値!E:F,2,0))","v":10},"―","―",{"$f":"IF(ISBLANK(B65),\"△\",VLOOKUP(B65,固定数値!G:H,2,0))","v":49.5},"―",null,"連結１",{"$f":"IFERROR(IF((BD68-(AR73+AS73))<0,\"\",IF($F$70<=BD66,BD65,\"\")),\"\")","v":""},{"$f":"IFERROR(IF((BE68-(AR73+AS73))<0,\"\",IF($F$70<=BE66,BE65,\"\")),\"\")","v":""},{"$f":"IFERROR(IF((BF68-(AR73+AS73))<0,\"\",IF($F$70>=55,\"\",IF($F$70>=35,BF65,\"\"))),\"\")","v":""},{"$f":"IFERROR(IF((BG68-(AR73+AS73))<0,\"\",IF($F$70<=BG66,BG65,\"\")),\"\")","v":""},{"$f":"IFERROR(IF((BH68-(AR73+AS73))<0,\"\",IF($F$70>=72,\"\",IF($F$70>=47,BH65,\"\"))),\"\")","v":""},"ﾌﾟﾙﾀﾞｳﾝﾘｽﾄ",{"$f":"IF(BD67=\"\",\"\",\"600\")","v":""},{"$f":"IF(BE67=\"\",\"\",\"900\")","v":""},{"$f":"IF(BG67=\"\",\"\",\"1200\")","v":""},{"$f":"IF(BF67=\"\",\"\",\"ウェーブS\")","v":""},{"$f":"IF(BH67=\"\",\"\",\"ウェーブ\")","v":""}]
[null,null,null,null,null,{"$f":"IF(G65=\"\",\"〇\",IF(COUNTIF(BJ67:BN67,G65)=0,\"×\",\"〇\"))","v":"〇"},{"$f":"IF(E67=\"ナシ\",\"×\",\"〇\")","v":"〇"},null,null,null,null,{"$f":"IF(OR(L66=\"\",L66=\"手すりを選択\"),\"〇\",\"×\")","v":"〇"},null,null,null,{"$f":"IF(Q65=\"\",\"〇\",IF(COUNTIF(BJ69:BN69,Q65)=0,\"×\",\"〇\"))","v":"〇"},{"$f":"IF(O67=\"ナシ\",\"×\",\"〇\")","v":"〇"},null,null,null,null,{"$f":"IF(OR(V66=\"\",V66=\"手すりを選択\"),\"〇\",\"×\")","v":"〇"},null,null,null,null,null,null,null,null,null,null,null,null,null,null,null,null,null,null,null,null,null,null,null,null,null,"連①","―",{"$f":"IF(ISBLANK(G65),\"△\",IF(G65=\"600\",\"48.5\",IF(G65=\"900\",\"78.5\",IF(G65=\"1200\",\"108.5\",IF(G65=\"ウェーブS\",\"95.904\",IF(G65=\"ウェーブ\",\"123.084\",\"\"))))))","v":"△"},{"$f":"IF(G65=\"\",\"△\",((AX68^2-F70^2)^0.5)+(7.99*2))","v":"△"},"―",{"$f":"IF(G65=\"\",\"△\",ASIN(F70/AX68))","v":"△"},null,"ｱ)ﾍﾞｰｽ間距離",{"$f":"IFERROR(IF(OR($AW$67=\"△\",$AW$69=\"△\"),((BD64^2-$F$70^2)^0.5)+(7.99*2)-(10+7.5),((BD64^2-$F$70^2)^0.5)+(7.99*2)-($AW$67+$AW$69)),\"E\")","v":"E"},{"$f":"IFERROR(IF(OR($AW$67=\"△\",$AW$69=\"△\"),((BE64^2-$F$70^2)^0.5)+(7.99*2)-(10+7.5),((BE64^2-$F$70^2)^0.5)+(7.99*2)-($AW$67+$AW$69)),\"E\")","v":"E"},"E","E",{"$f":"IFERROR(IF(OR($AW$67=\"△\",$AW$69=\"△\"),((BH64^2-$F$70^2)^0.5)+(7.99*2)-(10+7.5),((BH64^2-$F$70^2)^0.5)+(7.99*2)-($AW$67+$AW$69)),\"E\")","v":"E"}]
[null,null,null,null,null,"ア",null,null,null,"イ",null,null,null,null,null,"上段 必要スペース",null,null,null,null,null,{"$f":"IFERROR(IF(AW77-(((F29-AZ69)/2)+((AW80-1)*F29))+AZ67>=AZ67,ROUNDUP((AW77-(((F29-AZ69)/2)+((AW80-1)*F29))+AZ67),0),\"×\"),\"\")","v":""},null,"cm以上",null,null,null,null,null,null,null,null,null,null,null,null,null,null,null,null,null,null,null,null,null,null,null,"リ②",{"$f":"IF(ISBLANK(L65),\"△\",VLOOKUP(L65,固定数値!E:F,2,0))","v":7.5},"―","―",{"$f":"IF(ISBLANK(L65),\"△\",VLOOKUP(L65,固定数値!G:H,2,0))","v":28},"―",null,"連結２",{"$f":"IFERROR(IF((BD70-(AR74+AS74))<0,\"\",IF($J$70<=BD66,BD65,\"\")),\"\")","v":""},{"$f":"IFERROR(IF((BE70-(AR74+AS74))<0,\"\",IF($J$70<=BE66,BE65,\"\")),\"\")","v":""},{"$f":"IFERROR(IF((BF70-(AR74+AS74))<0,\"\",IF($J$70>=55,\"\",IF($J$70>=35,BF65,\"\"))),\"\")","v":""},{"$f":"IFERROR(IF((BG70-(AR74+AS74))<0,\"\",IF($J$70<=BG66,BG65,\"\")),\"\")","v":""},{"$f":"IFERROR(IF((BH70-(AR74+AS74))<0,\"\",IF($J$70>=72,\"\",IF($J$70>=47,BH65,\"\"))),\"\")","v":""},"ﾌﾟﾙﾀﾞｳﾝﾘｽﾄ",{"$f":"IF(BD69=\"\",\"\",\"600\")","v":""},{"$f":"IF(BE69=\"\",\"\",\"900\")","v":""},{"$f":"IF(BG69=\"\",\"\",\"1200\")","v":""},{"$f":"IF(BF69=\"\",\"\",\"ウェーブS\")","v":""},{"$f":"IF(BH69=\"\",\"\",\"ウェーブ\")","v":""}]
[null,"段　差",null,null,null,{"$f":"IFERROR(IF(F29=\"\",\"\",AW80*$F$26),\"\")","v":""},null,"cm",null,{"$f":"IFERROR(IF(F29=\"\",\"\",AX80*$F$26),\"\")","v":""},null,"cm",null,null,null,"下段 必要スペース",null,null,null,null,null,{"$f":"IFERROR(IF(AX77-(((F29-AZ69)/2)+((AX80-1)*F29))+AZ71>=AZ71,ROUNDUP((AX77-(((F29-AZ69)/2)+((AX80-1)*F29))+AZ71),0),\"×\"),\"\")","v":""},null,"cm以上",null,null,null,null,null,null,null,null,null,null,null,null,null,null,null,null,null,null,null,null,null,null,null,"連②","―",{"$f":"IF(ISBLANK(Q65),\"△\",IF(Q65=\"600\",\"48.5\",IF(Q65=\"900\",\"78.5\",IF(Q65=\"1200\",\"108.5\",IF(Q65=\"ウェーブS\",\"95.904\",IF(Q65=\"ウェーブ\",\"123.084\",\"\"))))))","v":"△"},{"$f":"IF(Q65=\"\",\"△\",((AX70^2-J70^2)^0.5)+(7.99*2))","v":"△"},"―",{"$f":"IF(Q65=\"\",\"△\",ASIN(J70/AX70))","v":"△"},null,"ｲ)ﾍﾞｰｽ間距離",{"$f":"IFERROR(IF(OR($AW$69=\"△\",$AW$71=\"△\"),((BD64^2-$J$70^2)^0.5)+(7.99*2)-(10+7.5),((BD64^2-$J$70^2)^0.5)+(7.99*2)-($AW$69+$AW$71)),\"E\")","v":"E"},{"$f":"IFERROR(IF(OR($AW$69=\"△\",$AW$71=\"△\"),((BE64^2-$J$70^2)^0.5)+(7.99*2)-(10+7.5),((BE64^2-$J$70^2)^0.5)+(7.99*2)-($AW$69+$AW$71)),\"E\")","v":"E"},{"$f":"IFERROR(IF(OR($AW$69=\"△\",$AW$71=\"△\"),((BF64^2-$J$70^2)^0.5)+(7.99*2)-(10+7.5),((BF64^2-$J$70^2)^0.5)+(7.99*2)-($AW$69+$AW$71)),\"E\")","v":"E"},{"$f":"IFERROR(IF(OR($AW$69=\"△\",$AW$71=\"△\"),((BG64^2-$J$70^2)^0.5)+(7.99*2)-(10+7.5),((BG64^2-$J$70^2)^0.5)+(7.99*2)-($AW$69+$AW$71)),\"E\")","v":"E"},{"$f":"IFERROR(IF(OR($AW$69=\"△\",$AW$71=\"△\"),((BH64^2-$J$70^2)^0.5)+(7.99*2)-(10+7.5),((BH64^2-$J$70^2)^0.5)+(7.99*2)-($AW$69+$AW$71)),\"E\")","v":"E"}]
[null,"連結バー角度",null,null,null,{"$f":"IFERROR(BA68*180/PI(),\"\")","v":""},null,"°",null,{"$f":"IFERROR(BA70*180/PI(),\"\")","v":""},null,"°",null,null,null,null,null,null,null,null,null,null,null,null,null,null,null,null,null,null,null,null,null,null,null,null,null,null,null,null,null,null,null,null,null,null,null,"リ③",{"$f":"IF(ISBLANK(V65),\"△\",VLOOKUP(V65,固定数値!E:F,2,0))","v":10},"―","―",{"$f":"IF(ISBLANK(V65),\"△\",VLOOKUP(V65,固定数値!G:H,2,0))","v":49.5},"―"]
[null,"水平部分角度",null,null,null,{"$f":"IFERROR(IF(G65=\"ウェーブ\",F71-29.22,IF(G65=\"ウェーブS\",F71-27.98,\"\")),\"\")","v":""},null,"°",null,{"$f":"IFERROR(IF(Q65=\"ウェーブ\",J71-29.22,IF(Q65=\"ウェーブS\",J71-27.98,\"\")),\"\")","v":""},null,"°",null,null,null,null,null,{"$f":"IF(G65=\"\",\"未選択\",G65)","v":"未選択"}]
[null,null,null,null,null,null,null,null,null,null,null,null,null,null,null,null,null,null,null,null,null,null,{"$f":"IF(Q65=\"\",\"未選択\",Q65)","v":"未選択"},null,null,null,null,null,null,null,null,null,null,null,null,null,null,null,null,null,null,null,"上",{"$f":"(F29-AZ69)/2","v":-14},{"$f":"(AW80-1)*F29","v":{"$error":"#VALUE!"}}]
[null,"段　数",null,{"$f":"$F$23","v":0},null,"段",null,null,null,null,null,null,null,null,null,null,null,null,null,null,null,null,null,null,null,null,null,null,null,null,null,null,null,null,null,null,null,null,null,null,null,null,"下",{"$f":"(F29-AZ69)/2","v":-14},{"$f":"(AX80-1)*F29","v":{"$error":"#VALUE!"}},null,null,null,"ア","イ",null,null,"ア","イ",null,null,null,null,null,null,"ショート判定",null,null,"ダブル判定"]
[null,"蹴　上",null,{"$f":"$F$26","v":0},null,"㎝",null,null,null,null,null,null,null,null,"上段",null,null,null,null,null,null,null,null,null,null,null,null,null,null,null,null,null,null,null,null,null,null,null,null,null,null,null,null,null,null,null,null,"最低ベース間距離",{"$f":"IF(F29=\"\",\"△\",(AW80-1)*$F$29)","v":"△"},{"$f":"IF(F29=\"\",\"△\",(AX80-1)*$F$29)","v":"△"},null,"角度チェック",{"$f":"IF(F72=\"\",\"△\",COUNTIFS(F72,\">=\"&-7.014,F72,\"<=\"&7.014))","v":"△"},{"$f":"IF(J72=\"\",\"△\",COUNTIFS(J72,\">=\"&-7.014,J72,\"<=\"&7.014))","v":"△"},null,null,null,null,null,null,"上段","下段","チェック","上段","中間１","下段","チェック"]
[null,"踏　面",null,{"$f":"$F$29","v":0},null,"㎝",null,null,null,null,null,null,null,{"$f":"IF(B65=\"\",\"未選択\",B65)","v":"シングル"},null,null,null,null,{"$f":"L64","v":""},null,null,null,null,null,null,null,null,null,null,null,null,null,null,null,null,null,null,null,null,null,null,null,null,null,null,null,null,"必要最大ﾍﾞｰｽ間",{"$f":"IF(F70=\"\",\"△\",(((123.084^2-$F70^2)^0.5)+(7.99*2))-(10+7.5))","v":"△"},{"$f":"IF(J70=\"\",\"△\",(((123.084^2-J70^2)^0.5)+(7.99*2))-(7.5+10))","v":"△"},null,"(F)40°以上×",{"$f":"IF(F71=\"\",\"△\",IF(F71<=40.2,\"〇\",\"×\"))","v":"△"},{"$f":"IF(J71=\"\",\"△\",IF(J71<=40.2,\"〇\",\"×\"))","v":"△"},null,null,null,null,null,null,{"$f":"IF(B65=\"ショート\",\"S\",IF(B65=\"ショートダブル\",\"S\",\"\"))","v":""},{"$f":"IF(V65=\"ショート\",\"S\",IF(V65=\"ショートダブル\",\"S\",\"\"))","v":""},{"$f":"COUNTIFS(BI76:BJ76,\"S\")","v":0},{"$f":"IF(OR(B65=\"ダブル\",B65=\"ショートダブル\"),\"D\",\"\")","v":""},{"$f":"IF(OR(L65=\"ダブル\",L65=\"ショートダブル\"),\"D\",\"\")","v":""},{"$f":"IF(OR(V65=\"ダブル\",V65=\"ショートダブル\"),\"D\",\"\")","v":""},{"$f":"COUNTIFS(BL76:BN76,\"D\")","v":0}]
[null,"【シミュレーション結果の各種TAISコード】",null,null,null,null,null,null,null,null,null,null,null,null,null,null,null,null,{"$f":"IF(L65=\"\",\"未選択\",L65)","v":"ショート"},null,null,null,null,"下段",null,{"$f":"IF(V65=\"\",\"未選択\",IF(V66=\"ショート不可\",\"×\",V65))","v":"シングル"},null,null,null,null,null,null,null,null,null,null,null,null,null,null,null,null,null,null,null,null,null,"ベース間距離",{"$f":"IFERROR($AY$68-($AW$67+$AW$69),\"\")","v":""},{"$f":"IFERROR($AY$70-($AW$69+$AW$71),\"\")","v":""},null,"(G)-7.01～7.01°",{"$f":"IF(G65=\"\",\"△\",IF(OR(BA75=1,BA75=\"△\"),\"〇\",\"×\"))","v":"△"},{"$f":"IF(Q65=\"\",\"△\",IF(OR(BB75=1,BB75=\"△\"),\"〇\",\"×\"))","v":"△"}]
[null,null,null,null,null,null,null,null,null,null,null,null,null,null,null,null,null,null,null,null,null,null,null,null,null,null,null,null,null,null,null,null,null,null,null,null,null,null,null,null,null,null,null,null,null,null,null,"最小斜辺",{"$f":"IFERROR(( AW79^2 +F70^2)^0.5,\"\")","v":""},{"$f":"IFERROR(( AX79^2 +J70^2)^0.5,\"\")","v":""},null,"必要スペース",{"$f":"AA66","v":"〇"},{"$f":"AB66","v":"〇"}]
[null,{"$f":"IF(OR(F61=\"×\",F61=\"\",F61=\"△\"),\"\",IF(OR(B65=\"\",G65=\"\"),\"\",IF(OR(B65=\"ダブル\",B65=\"ショートダブル\"),B65&\"＋連結バー\"&G65&\" 2本セット\",B65&\"+連結バー\"&G65&\" セット\")))","v":""},null,null,null,null,null,null,null,null,null,{"$f":"IF(OR(F61=\"×\",F61=\"\",F61=\"△\"),\"\",IF(OR(L65=\"\",Q65=\"\"),\"\",IF(OR(L65=\"ダブル\",L65=\"ショートダブル\"),L65&\"＋連結バー\"&Q65&\" 2本セット\",L65&\"+連結バー\"&Q65&\" セット\")))","v":""},null,null,null,null,null,null,null,null,null,{"$f":"IF(OR(F61=\"×\",F61=\"\",F61=\"△\"),\"\",IF(V65=\"\",\"\",V65&\" ※単体\"))","v":""},null,null,null,null,null,null,null,null,null,null,null,null,null,null,null,null,null,null,null,null,null,null,null,null,null,"最小底辺",{"$f":"(AW75+AW67+AW69)-(7.99*2)","v":{"$error":"#VALUE!"}},{"$f":"(AX75+AW69+AW71)-(7.99*2)","v":{"$error":"#VALUE!"}},null,"(A)72cm以下",{"$f":"IF(F70=\"\",\"△\",IF(F70<=72,\"〇\",\"×\"))","v":"△"},{"$f":"IF(J70=\"\",\"△\",IF(J70<=72,\"〇\",\"×\"))","v":"△"}]
[null,{"$f":"IFERROR(IF(OR(F61=\"×\",F61=\"\",F61=\"△\"),\"\",INDEX(TAISﾘｽﾄ!$B$3:$L$19,MATCH(B65,TAISﾘｽﾄ!$A$3:$A$19,0),MATCH(G65,TAISﾘｽﾄ!$B$2:$L$2,0))),\"\")","v":""},null,null,null,null,null,null,null,null,null,{"$f":"IFERROR(IF(OR(F61=\"×\",F61=\"\",F61=\"△\"),\"\",INDEX(TAISﾘｽﾄ!$B$3:$L$19,MATCH(L65,TAISﾘｽﾄ!$A$3:$A$19,0),MATCH(Q65,TAISﾘｽﾄ!$B$2:$L$2,0))),\"\")","v":""},null,null,null,null,null,null,null,null,null,{"$f":"IFERROR(IF(OR(F61=\"×\",F61=\"\",F61=\"△\"),\"\",INDEX(TAISﾘｽﾄ!B3:B19,MATCH(V65,TAISﾘｽﾄ!A3:A19,0))),\"\")","v":""},null,null,null,null,null,null,null,null,null,null,null,null,null,null,null,null,null,null,null,null,null,null,null,null,null,"段数",{"$f":"IF(ROUNDDOWN($F$23/2,0)<=0,\"×\",ROUNDDOWN($F$23/2,0))","v":"×"},{"$f":"F23-AW80","v":{"$error":"#VALUE!"}},null,"連結判定",{"$f":"IF(G65=\"\",\"△\",IF(COUNTIFS(BA76:BA78,\"*×*\")>0,\"×\",\"〇\"))","v":"△"},{"$f":"IF(Q65=\"\",\"△\",IF(COUNTIFS(BB76:BB78,\"*×*\")>0,\"×\",\"〇\"))","v":"△"}]
[]
[]
[]
[]
[]
[null,null,null,null,null,{"$f":"IFERROR(IF(OR(F23=\"\",F26=\"\",F29=\"\"),\"\",IF(AND(D87=\"×\",E87=\"〇\"),\"△\",IF(AND(C87=\"×\",E87=\"〇\"),\"△\",IF(X93=\"△\",\"△\",IF(COUNTIFS(AD87:AG91,\"*×*\")>0,\"×\",\"〇\"))))),\"\")","v":""},null,null,null,null,null,null,null,null,null,null,null,null,null,null,null,null,null,null,null,null,null,null,null,null,null,null,null,null,null,null,null,null,null,null,null,null,null,null,null,null,null,null,null,null,null,null,null,null,"斜辺",48.5,78.5,95.903999999999996,108.5,123.084,null,"ショート判定",null,null,"ダブル判定"]
[null,{"$f":"IF(OR($F$23=\"\",$F$26=\"\",$F$29=\"\"),\"\",\"〇\")","v":""},{"$f":"IF(OR(J93=\"×\",R93=\"×\",Z93=\"×\"),\"×\",\"〇\")","v":"〇"},{"$f":"IF(OR(F93=\"×\",V93=\"×\",N93=\"×\"),\"×\",\"〇\")","v":"〇"},{"$f":"IF(AND(G93=\"〇\",W93=\"〇\",O93=\"〇\"),\"〇\",\"×\")","v":"〇"},{"$f":"IF(F86=\"△\",\"※一部製品を変更すると設置可能です。対象品は緑で表示されております。\",\"\")","v":""},null,null,null,null,null,null,null,null,null,null,null,null,null,null,null,null,null,null,null,null,null,null,null,{"$f":"IF(F92=\"ナシ\",\"×\",\"〇\")","v":"〇"},{"$f":"IF(V92=\"ナシ\",\"×\",\"〇\")","v":"〇"},{"$f":"IF(F23<4,\"×\",\"〇\")","v":"×"},{"$f":"IF(N92=\"ナシ\",\"×\",\"〇\")","v":"〇"},null,null,null,null,null,null,null,null,null,null,null,null,null,null,null,null,null,null,null,null,null,null,"☆600 ","☆900 ","☆ウェーブS ","☆1200 ","☆ウェーブ ",null,"上段","下段","チェック","上段","中間１","中間２","下段","チェック"]
[null,"【組み合わせシミュレーション】",null,null,null,null,null,null,null,null,null,null,null,null,null,null,null,null,null,null,null,null,null,null,null,null,null,null,null,{"$f":"IF(B91=\"\",\"〇\",IF(B91=\"手すりを選択\",\"△\",\"×\"))","v":"〇"},{"$f":"IF(J91=\"\",\"〇\",IF(J91=\"手すりを選択\",\"△\",\"×\"))","v":"〇"},{"$f":"IF(R91=\"\",\"〇\",IF(R91=\"手すりを選択\",\"△\",\"×\"))","v":"〇"},{"$f":"IF(Z91=\"\",\"〇\",IF(Z91=\"手すりを選択\",\"△\",\"×\"))","v":"〇"},null,null,null,null,null,null,null,null,null,null,"シングル",{"$f":"IF(OR(B90=AR88,B90=AR90,B90=AR91),AR88,\"\")","v":"シングル"},{"$f":"IF($BI$95=\"△\",\"\",AR88)","v":"シングル"},null,"【Ｃ 踏面に手すり２台設置】必要数値",null,null,null,null,null,null,"段差",30,50,"35~55",70,"47~72",null,{"$f":"IF(B90=\"ショート\",\"S\",IF(B90=\"ショートダブル\",\"S\",\"\"))","v":""},{"$f":"IF(Z90=\"ショート\",\"S\",IF(Z90=\"ショートダブル\",\"S\",\"\"))","v":""},{"$f":"COUNTIFS(BJ88:BK88,\"S\")","v":0},{"$f":"IF(OR(B90=\"ダブル\",B90=\"ショートダブル\"),\"D\",\"\")","v":""},{"$f":"IF(OR(J90=\"ダブル\",J90=\"ショートダブル\"),\"D\",\"\")","v":""},{"$f":"IF(OR(R90=\"ダブル\",R90=\"ショートダブル\"),\"D\",\"\")","v":""},{"$f":"IF(OR(Z90=\"ダブル\",Z90=\"ショートダブル\"),\"D\",\"\")","v":""},{"$f":"COUNTIFS(BM88:BP88,\"D\")","v":0}]
[null,"上段",null,null,null,"連結①",null,null,null,{"$f":"IFERROR(IF(B87=\"\",\"\",IF(COUNTIFS(AD89:AG90,\"*×*\")>0,\"×\",$F$23-AW99)),\"―\")","v":""},null,null,null,"連結②",null,null,null,{"$f":"IFERROR(IF(B87=\"\",\"\",IF(COUNTIFS(AD89:AG90,\"*×*\")>0,\"×\",IF($F$23-AX106-AW106<=0,\"×\",$F$23-AX106-AW106))),\"―\")","v":""},null,null,null,"連結③",null,null,null,"下段",null,null,null,{"$f":"IF($F$23=\"\",\"×\",IF($F$23<=2,\"×\",\"〇\"))","v":"×"},{"$f":"IF($F$26=\"\",\"×\",IF(OR(F26<1,F26>30),\"×\",\"〇\"))","v":"×"},{"$f":"IF($F$29=\"\",\"×\",IF(OR(F29<28,F29>50),\"×\",IF(F29=0,\"×\",\"〇\")))","v":"×"},null,null,null,null,null,null,null,null,null,null,null,"ダブル",{"$f":"IF(OR(B90=AR89,B90=AR92),AR89,\"\")","v":""},null,null,null,"⑤ﾍﾞｰｽ端から芯","①斜辺","④支柱間距離","ベースサイズ","連結バー角度",null,"連結１",{"$f":"IFERROR(IF((BD90-(AU104+AU98))<0,\"\",IF($F$95<=BD88,BD87,\"\")),\"\")","v":""},{"$f":"IFERROR(IF((BE90-(AU104+AU98))<0,\"\",IF($F$95<=BE88,BE87,\"\")),\"\")","v":""},{"$f":"IFERROR(IF((BF90-(AU104+AU98))<0,\"\",IF($F$95>=55,\"\",IF($F$95>=35,BF87,\"\"))),\"\")","v":""},{"$f":"IFERROR(IF((BG90-(AU104+AU98))<0,\"\",IF($F$95<=BG88,BG87,\"\")),\"\")","v":""},{"$f":"IFERROR(IF((BH90-(AU104+AU98))<0,\"\",IF($F$95>=72,\"\",IF($F$95>=47,BH87,\"\"))),\"\")","v":""},"連結①",{"$f":"IF(BD89=\"\",\"\",\"600\")","v":""},{"$f":"IF(BE89=\"\",\"\",\"900\")","v":""},{"$f":"IF(BG89=\"\",\"\",\"1200\")","v":""},{"$f":"IF(BF89=\"\",\"\",\"ウェーブS\")","v":""},{"$f":"IF(BH89=\"\",\"\",\"ウェーブ\")","v":""}]
[null,"シングル",null,null,null,null,null,null,null,{"$f":"IF(OR(B90=\"ダブル\",B90=\"ショートダブル\"),\"ショートダブル\",\"ショート\")","v":"ショート"},null,null,null,null,null,null,null,{"$f":"IF(OR(B90=\"ダブル\",B90=\"ショートダブル\"),\"ショートダブル\",\"ショート\")","v":"ショート"},null,null,null,null,null,null,null,"シングル",null,null,null,null,{"$f":"IF(COUNTIFS(BD99:BF99,\"*×*\")>0,\"×\",\"〇\")","v":"〇"},null,null,null,null,null,null,null,null,null,null,null,null,"ロング",{"$f":"IF(OR(B90=AR88,B90=AR90,B90=AR91),AR90,\"\")","v":"ロング"},null,null,"リ①",{"$f":"IF(ISBLANK(B90),\"△\",VLOOKUP(B90,固定数値!E:F,2,0))","v":10},"―","―",{"$f":"IF(ISBLANK(B90),\"△\",VLOOKUP(B90,固定数値!G:H,2,0))","v":49.5},"―",null,"ｱ)ﾍﾞｰｽ間距離",{"$f":"IFERROR(IF(OR($AW$90=\"△\",$AW$92=\"△\"),((BD86^2-$F$95^2)^0.5)+(7.99*2)-(10+7.5),((BD86^2-$F$95^2)^0.5)+(7.99*2)-($AW$90+$AW$92)),\"E\")","v":"E"},{"$f":"IFERROR(IF(OR($AW$90=\"△\",$AW$92=\"△\"),((BE86^2-$F$95^2)^0.5)+(7.99*2)-(10+7.5),((BE86^2-$F$95^2)^0.5)+(7.99*2)-($AW$90+$AW$92)),\"E\")","v":"E"},{"$f":"IFERROR(IF(OR($AW$90=\"△\",$AW$92=\"△\"),((BF86^2-$F$95^2)^0.5)+(7.99*2)-(10+7.5),((BF86^2-$F$95^2)^0.5)+(7.99*2)-($AW$90+$AW$92)),\"E\")","v":"E"},{"$f":"IFERROR(IF(OR($AW$90=\"△\",$AW$92=\"△\"),((BG86^2-$F$95^2)^0.5)+(7.99*2)-(10+7.5),((BG86^2-$F$95^2)^0.5)+(7.99*2)-($AW$90+$AW$92)),\"E\")","v":"E"},{"$f":"IFERROR(IF(OR($AW$90=\"△\",$AW$92=\"△\"),((BH86^2-$F$95^2)^0.5)+(7.99*2)-(10+7.5),((BH86^2-$F$95^2)^0.5)+(7.99*2)-($AW$90+$AW$92)),\"E\")","v":"E"},"連結②",{"$f":"IFERROR(IF(BA105=\"※設置不可\",\"\",\"600\"),\"\")","v":""},{"$f":"IFERROR(IF(BD105=\"設置可能\",\"900\",\"\"),\"\")","v":""},{"$f":"IFERROR(IF(BB105=\"設置可能\",\"1200\",\"\"),\"\")","v":""},{"$f":"IFERROR(IF(BC105=\"設置可能\",\"ウェーブS\",\"\"),\"\")","v":""},{"$f":"IFERROR(IF(BE105=\"設置可能\",\"ウェーブ\",\"\"),\"\")","v":""},{"$f":"IF(BJ90=\"\",\"\",\"☆\"&BJ90)","v":""},{"$f":"IF(BK90=\"\",\"\",\"☆\"&BK90)","v":""},{"$f":"IF(BL90=\"\",\"\",\"☆\"&BL90)","v":""},{"$f":"IF(BM90=\"\",\"\",\"☆\"&BM90)","v":""},{"$f":"IF(BN90=\"\",\"\",\"☆\"&BN90)","v":""}]
[null,{"$f":"IF(B90=\"\",\"手すりを選択\",\"\")","v":""},null,null,null,{"$f":"IF(N90=\"\",\"\",IF(F90=\"\",\"連結①を選択\",IF(AND(D87=\"×\",E87=\"〇\",F93=\"×\",G93=\"〇\"),\"製品を変更\",\"\")))","v":""},null,null,null,null,null,null,null,{"$f":"IF(B87=\"\",\"\",IF(AND(N90=\"\",N93=\"〇\"),\"連結②を選択\",IF(AND(N93=\"×\",O93=\"〇\"),\"製品を変更\",\"\")))","v":""},null,null,null,null,null,null,null,{"$f":"IF(N90=\"\",\"\",IF(V90=\"\",\"連結③を選択\",IF(AND(D87=\"×\",E87=\"〇\",V93=\"×\",W93=\"〇\"),\"製品を変更\",\"\")))","v":""},null,null,null,{"$f":"IF(Z90=\"\",\"手すりを選択\",IF(AND(B90=\"ショートダブル\",BK88=\"S\"),\"ダブルに変更\",IF(AND(B90=\"ダブル\",BP88=\"\"),\"両手すりに変更\",IF(AND(BJ88=\"S\",Z90=\"ショートダブル\"),\"片手すり(大ベース)に変更\",IF(AND(BM88=\"\",BP88=\"D\"),\"片手すりに変更\",IF(AND(BJ88=\"S\",BK88=\"S\"),\"大ベース製品に変更\",IF(AND(B45=\"ショートダブル\",BG55=\"\"),\"ダブルに変更\",\"\")))))))","v":""},null,null,null,{"$f":"IF(AZ90=\"△\",\"△\",IF(W94=\"×\",\"×\",IF(AZ90<=W94,\"〇\",\"×\")))","v":"〇"},{"$f":"IF(AZ96=\"△\",\"△\",IF(W95=\"×\",\"×\",IF(AZ96<=W95,\"〇\",\"×\")))","v":"〇"},{"$f":"IF(COUNTIFS(BD100:BF100,\"*×*\")>0,\"×\",\"〇\")","v":"〇"},{"$f":"IF(COUNTIFS(AW106:AY106,\"*×*\")>0,\"×\",\"〇\")","v":"〇"},null,null,null,null,null,null,null,null,null,null,"ショート",{"$f":"IF(OR(B90=AR88,B90=AR90),AR91,\"\")","v":"ショート"},null,null,"連①","―",{"$f":"IF(ISBLANK(F90),\"△\",IF(F90=\"600\",\"48.5\",IF(F90=\"900\",\"78.5\",IF(F90=\"1200\",\"108.5\",IF(F90=\"ウェーブS\",\"95.904\",IF(F90=\"ウェーブ\",\"123.084\",\"\"))))))","v":"△"},{"$f":"IF(F90=\"\",\"△\",((AX91^2-$F95^2)^0.5)+(7.99*2))","v":"△"},"―",{"$f":"IF(F90=\"\",\"△\",ASIN(F95/AX91))","v":"△"},null,"連結3",{"$f":"IFERROR(IF((BD92-(AU104+AT98))<0,\"\",IF(BD93<0,\"\",IF($L$95<=BD88,BD87,\"\"))),\"\")","v":""},{"$f":"IFERROR(IF((BE92-(AU104+AT98))<0,\"\",IF(BE93<0,\"\",IF($L$95<=BE88,BE87,\"\"))),\"\")","v":""},{"$f":"IFERROR(IF((BF92-(AU104+AT98))<0,\"\",IF(BF93<0,\"\",IF($L$95>=55,\"\",IF($L$95>=35,BF87,\"\")))),\"\")","v":""},{"$f":"IFERROR(IF((BG92-(AU104+AT98))<0,\"\",IF(BG93<0,\"\",IF($L$95<=BG88,BG87,\"\"))),\"\")","v":""},{"$f":"IFERROR(IF((BH92-(AU104+AT98))<0,\"\",IF(BH93<0,\"\",IF($L$95>=72,\"\",IF($L$95>=47,BH87,\"\")))),\"\")","v":""},"連結③",{"$f":"IF(BD91=\"\",\"\",\"600\")","v":""},{"$f":"IF(BE91=\"\",\"\",\"900\")","v":""},{"$f":"IF(BG91=\"\",\"\",\"1200\")","v":""},{"$f":"IF(BF91=\"\",\"\",\"ウェーブS\")","v":""},{"$f":"IF(BH91=\"\",\"\",\"ウェーブ\")","v":""}]
[null,null,null,null,null,{"$f":"IF(AND(N93=\"〇\",N90=\"\"),\"\",IF(B87=\"\",\"\",IF(AND(BD89=\"\",BE89=\"\",BF89=\"\",BG89=\"\",BH89=\"\"),\"ナシ\",IF(COUNTIFS(AD89:AG90,\"×\")>0,\"ナシ\",BD89&BE89&BG89&BF89&BH89))))","v":""},null,null,null,null,null,null,null,{"$f":"IF(B87=\"\",\"\",IF(AND(BJ90=\"\",BK90=\"\",BL90=\"\",BM90=\"\",BN90=\"\"),\"ナシ\",IF(COUNTIFS(AD89:AG90,\"×\")>0,\"ナシ\",BO90&BP90&BQ90&BR90&BS90)))","v":""},null,null,null,null,null,null,null,{"$f":"IF(AND(N93=\"〇\",N90=\"\"),\"\",IF(B87=\"\",\"\",IF(AND(BD91=\"\",BE91=\"\",BF91=\"\",BG91=\"\",BH91=\"\"),\"ナシ\",IF(COUNTIFS(AD89:AG90,\"×\")>0,\"ナシ\",BD91&BE91&BG91&BF91&BH91))))","v":""},null,null,null,null,null,null,null,null,null,null,null,null,null,null,null,null,null,null,null,null,null,"ショートダブル",{"$f":"IF(B90=AR89,AR92,\"\")","v":""},null,null,"リ②",{"$f":"IF(ISBLANK(J90),\"△\",VLOOKUP(J90,固定数値!E:F,2,0))","v":7.5},"―","―",{"$f":"IF(ISBLANK(J90),\"△\",VLOOKUP(J90,固定数値!G:H,2,0))","v":28},"―",null,"ｳ)ﾍﾞｰｽ間距離",{"$f":"IFERROR(IF(OR($AW$94=\"△\",$AW$96=\"△\"),((BD86^2-$L$95^2)^0.5)+(7.99*2)-(10+7.5),((BD86^2-$L$95^2)^0.5)+(7.99*2)-($AW$94+$AW$96)),\"E\")","v":"E"},{"$f":"IFERROR(IF(OR($AW$94=\"△\",$AW$96=\"△\"),((BE86^2-$L$95^2)^0.5)+(7.99*2)-(10+7.5),((BE86^2-$L$95^2)^0.5)+(7.99*2)-($AW$94+$AW$96)),\"E\")","v":"E"},{"$f":"IFERROR(IF(OR($AW$94=\"△\",$AW$96=\"△\"),((BF86^2-$L$95^2)^0.5)+(7.99*2)-(10+7.5),((BF86^2-$L$95^2)^0.5)+(7.99*2)-($AW$94+$AW$96)),\"E\")","v":"E"},{"$f":"IFERROR(IF(OR($AW$94=\"△\",$AW$96=\"△\"),((BG86^2-$L$95^2)^0.5)+(7.99*2)-(10+7.5),((BG86^2-$L$95^2)^0.5)+(7.99*2)-($AW$94+$AW$96)),\"E\")","v":"E"},{"$f":"IFERROR(IF(OR($AW$94=\"△\",$AW$96=\"△\"),((BH86^2-$L$95^2)^0.5)+(7.99*2)-(10+7.5),((BH86^2-$L$95^2)^0.5)+(7.99*2)-($AW$94+$AW$96)),\"E\")","v":"E"}]
[null,null,null,null,null,{"$f":"IF(OR(F90=\"\",N90=\"\"),\"〇\",IF(COUNTIF(BJ89:BN89,F90)=0,\"×\",\"〇\"))","v":"〇"},{"$f":"IF(O93=\"〇\",\"〇\",IF(F92=\"ナシ\",\"×\",\"〇\"))","v":"〇"},null,null,{"$f":"IF(OR(J91=\"\",J91=\"手すりを選択\"),\"〇\",\"×\")","v":"〇"},null,null,null,{"$f":"IF(N90=\"\",\"〇\",IF(COUNTIF(BJ90:BN90,N90)=0,\"×\",\"〇\"))","v":"〇"},{"$f":"IF(N92=\"ナシ\",\"×\",\"〇\")","v":"〇"},null,null,{"$f":"IF(OR(R91=\"\",R91=\"手すりを選択\"),\"〇\",\"×\")","v":"〇"},null,null,null,{"$f":"IF(OR(N90=\"\",V90=\"\"),\"〇\",IF(COUNTIF(BJ91:BN91,V90)=0,\"×\",\"〇\"))","v":"〇"},{"$f":"IF(O93=\"〇\",\"〇\",IF(V92=\"ナシ\",\"×\",\"〇\"))","v":"〇"},{"$f":"IF(AND(BF98=\"×\",V93=\"〇\",W93=\"〇\"),\"△\",\"\")","v":""},null,{"$f":"IF(OR(Z91=\"\",Z91=\"手すりを選択\"),\"〇\",\"×\")","v":"〇"},null,null,null,null,null,null,null,null,null,null,null,null,null,null,null,null,null,null,null,null,null,"連②","―",{"$f":"IF(ISBLANK(N90),\"△\",IF(N90=\"600\",\"48.5\",IF(N90=\"900\",\"78.5\",IF(N90=\"1200\",\"108.5\",IF(N90=\"ウェーブS\",\"95.904\",IF(N90=\"ウェーブ\",\"123.084\",\"\"))))))","v":"△"},{"$f":"IF(I95=\"\",\"△\",((AX93^2-$I95^2)^0.5)+(7.99*2))","v":"△"},"―",{"$f":"IF(I95=\"\",\"△\",ASIN(I95/AX93))","v":"△"},null,null,{"$f":"(BD92-($AU$101+(($AY$106-1)*$D$102)))","v":{"$error":"#VALUE!"}},{"$f":"(BE92-($AU$101+(($AY$106-1)*$D$102)))","v":{"$error":"#VALUE!"}},{"$f":"(BF92-($AU$101+(($AY$106-1)*$D$102)))","v":{"$error":"#VALUE!"}},{"$f":"(BG92-($AU$101+(($AY$106-1)*$D$102)))","v":{"$error":"#VALUE!"}},{"$f":"(BH92-($AU$101+(($AY$106-1)*$D$102)))","v":{"$error":"#VALUE!"}}]
[null,null,null,null,null,"ア",null,null,"イ",null,null,"ウ",null,null,null,null,"上段 必要スペース",null,null,null,null,null,{"$f":"IFERROR(IF(AY98>=AZ90,ROUNDUP(AY98,0),\"×\"),\"\")","v":""},null,"cm以上",null,null,null,null,null,null,null,null,null,null,null,null,null,null,null,null,null,null,null,null,null,null,"リ③",{"$f":"IF(ISBLANK(R90),\"△\",VLOOKUP(R90,固定数値!E:F,2,0))","v":7.5},"―","―",{"$f":"IF(ISBLANK(R90),\"△\",VLOOKUP(R90,固定数値!G:H,2,0))","v":28},"―",null,null,"ア","イ","ウ","上段\nショートなら",null,{"$f":"AW103-AW101","v":{"$error":"#VALUE!"}}]
[null,"段　差",null,null,null,{"$f":"IF(F29=\"\",\"\",IFERROR((AW106*$F$26),\"\"))","v":""},null,"cm",{"$f":"IFERROR(IF(AV99>0,\"\",AX106*$F$26),\"\")","v":""},null,"cm",{"$f":"IFERROR(AY106*$F$26,\"\")","v":""},null,"cm",null,null,"下段 必要スペース",null,null,null,null,null,{"$f":"IFERROR(IF(AW98>=AZ96,ROUNDUP(AW98,0),\"×\"),\"\")","v":""},null,"cm以上",null,null,null,null,null,null,null,null,null,null,null,null,null,null,null,null,null,null,"実際上",null,null,null,"連③","―",{"$f":"IF(ISBLANK(V90),\"△\",IF(V90=\"600\",\"48.5\",IF(V90=\"900\",\"78.5\",IF(V90=\"1200\",\"108.5\",IF(V90=\"ウェーブS\",\"95.904\",IF(V90=\"ウェーブ\",\"123.084\",\"\"))))))","v":"△"},{"$f":"IF(V90=\"\",\"△\",((AX95^2-$L95^2)^0.5)+(7.99*2))","v":"△"},"―",{"$f":"IF(V90=\"\",\"△\",ASIN(L95/AX95))","v":"△"},null,"角度チェック",{"$f":"IF(F97=\"\",\"△\",COUNTIFS(F97,\">=\"&-7.014,F97,\"<=\"&7.014))","v":"△"},{"$f":"IF(I97=\"\",\"△\",COUNTIFS(I97,\">=\"&-7.014,I97,\"<=\"&7.014))","v":"△"},{"$f":"IF(L97=\"\",\"△\",COUNTIFS(L97,\">=\"&-7.014,L97,\"<=\"&7.014))","v":"△"},null,null,{"$f":"IFERROR(IF(BI94<-2.5,\"×\",IF(BI94>=0,\"〇\",\"△\")),\"\")","v":""},null,null,null,null,null,null,null,null,null,null,null,null,null,null,null,null,null,null,null,null,null,null,null,null,null,null,null,null,null,null,null,null,null,null,"D連結①シミュレーション"]
[null,"連結バー角度",null,null,null,{"$f":"IFERROR(BA91*180/PI(),\"\")","v":""},null,"°",{"$f":"IFERROR(BA93*180/PI(),\"\")","v":""},null,"°",{"$f":"IFERROR(BA95*180/PI(),\"\")","v":""},null,"°",null,null,null,null,null,null,null,null,null,null,null,null,null,null,null,null,null,null,null,null,null,null,null,null,null,null,null,null,null,"実際下",null,null,null,"リ④",{"$f":"IF(ISBLANK(Z90),\"△\",VLOOKUP(Z90,固定数値!E:F,2,0))","v":10},"―","―",{"$f":"IF(ISBLANK(Z90),\"△\",VLOOKUP(Z90,固定数値!G:H,2,0))","v":49.5},"―",null,"(F)40°以上×",{"$f":"IF(F96=\"\",\"△\",IF(F96<=40.2,\"〇\",\"×\"))","v":"△"},{"$f":"IF(I96=\"\",\"△\",IF(I96<=40.2,\"〇\",\"×\"))","v":"△"},{"$f":"IF(L96=\"\",\"△\",IF(L96<=40.2,\"〇\",\"×\"))","v":"△"},"下段\nショートなら",null,{"$f":"AY103-AY101","v":{"$error":"#VALUE!"}},null,null,null,null,null,null,null,null,null,null,null,null,null,null,null,null,null,null,null,null,null,null,null,null,null,null,null,null,null,null,null,null,null,null,null,null,"ア)\n段数","ア)\n段差","ア)\n必要ベ距離","ア)仮べ距離／判定／上段必要スペース\n連結①各パターン"]
[null,"水平部分角度",null,null,null,{"$f":"IFERROR(IF(F90=\"ウェーブ\",F96-29.22,IF(F90=\"ウェーブS\",F96-27.98,\"\")),\"\")","v":""},null,"°",{"$f":"IFERROR(IF(N90=\"ウェーブ\",I96-29.22,IF(N90=\"ウェーブS\",I96-27.98,\"\")),\"\")","v":""},null,"°",{"$f":"IFERROR(IF(V90=\"ウェーブ\",L96-29.22,IF(V90=\"ウェーブS\",L96-27.98,\"\")),\"\")","v":""},null,"°",null,null,null,null,{"$f":"IF(F90=\"\",\"未選択\",F90)","v":"未選択"},null,null,null,null,null,null,null,null,null,null,null,null,null,null,null,null,null,null,null,null,null,null,null,"あ","い","う","え","お","か","下段必スぺ",null,"上段必スぺ",null,null,null,"(G)-7.05～7.05°",{"$f":"IF(F90=\"\",\"△\",IF(OR(BD95=1,BD95=\"△\"),\"〇\",\"×\"))","v":"△"},{"$f":"IF(N90=\"\",\"△\",IF(OR(BE95=1,BE95=\"△\"),\"〇\",\"×\"))","v":"△"},{"$f":"IF(V90=\"\",\"△\",IF(OR(BF95=1,BF95=\"△\"),\"〇\",\"×\"))","v":"△"},null,null,{"$f":"IFERROR(IF(BI96<-2.5,\"×\",IF(BI96>=0,\"〇\",\"△\")),\"\")","v":""}]
[null,null,null,null,null,null,null,null,null,null,null,null,null,null,null,null,null,null,null,null,null,null,{"$f":"IF(N90=\"\",\"未選択\",N90)","v":"未選択"},null,null,null,null,null,null,null,null,null,null,null,null,null,null,null,null,null,null,null,{"$f":"AX103+AZ92+AZ94","v":{"$error":"#VALUE!"}},{"$f":"(AX106+1)*F29","v":{"$error":"#VALUE!"}},{"$f":"MIN(AU101:AU102)","v":{"$error":"#VALUE!"}},{"$f":"(AY106-1)*F29","v":{"$error":"#VALUE!"}},{"$f":"(AW106-1)*F29","v":{"$error":"#VALUE!"}},{"$f":"(AY103-(AS98+AT98))","v":{"$error":"#VALUE!"}},{"$f":"BA100+AZ96","v":{"$error":"#VALUE!"}},null,{"$f":"BA99+AZ90","v":{"$error":"#VALUE!"}},null,null,null,"必要スペース",{"$f":"AD91","v":"〇"},"―",{"$f":"AE91","v":"〇"},null,null,null,null,null,null,null,null,null,null,null,null,null,null,null,null,null,null,null,null,null,null,null,null,null,null,null,null,null,null,null,null,null,null,null,null,null,null,null,null,null,null,"600",null,"1200",null,"ウェーブS",null,"900",null,"ウェーブ",null,null,null,null,null,null,null,null,null,48.5,108.5,95.903999999999996,78.5,123.084]
[null,null,null,null,null,null,null,null,null,null,null,null,null,null,null,null,null,null,null,null,null,null,null,null,null,null,{"$f":"IF(V90=\"\",\"未選択\",V90)","v":"未選択"},null,null,null,null,null,null,null,null,null,null,null,null,null,null,null,null,"平均X",{"$f":"(AW103-(AU101+((AW106-1)*D102)))","v":{"$error":"#VALUE!"}},null,null,{"$f":"COUNTIFS(AW99:AY99,\"×\")","v":1},{"$f":"IFERROR(IF(AW106<=0,\"×\",AW106),\"×\")","v":"×"},null,{"$f":"IFERROR(IF(AY106<=0,\"×\",AY106),\"×\")","v":""},"採用X",{"$f":"IF(AS99<=0,AS104,AS99)","v":{"$error":"#VALUE!"}},null,"(A)72cm以下",{"$f":"IF(F95=\"\",\"△\",IF(F95<=72,\"〇\",\"×\"))","v":"△"},{"$f":"IF(I95=\"\",\"△\",IF(I95<=72,\"〇\",\"×\"))","v":"△"},{"$f":"IF(L95=\"\",\"△\",IF(L95<=72,\"〇\",\"×\"))","v":"△"},null,null,null,null,null,null,null,null,"ア)\n段数","ア)\n段差","ア)\n必要ベ\n距離","連結①／ア)ベ距離",null,null,null,null,null,null,null,null,null,"ウ)\n段数","ウ)\n段差","ウ)\n必要ベ\n距離","連結③／ウ)ベ距離",null,null,null,null,null,null,null,null,null,null,null,null,"連結②","600",{"$f":"IFERROR(IF(ROUNDDOWN(($F$23-($CD$119+$BQ$130))/2,0)<=0,\"×\",$AS$123-$CD$119),\"E\")","v":"E"},{"$f":"IFERROR(CT99*$D$127,\"E\")","v":"E"},{"$f":"IFERROR(((CT99-1)*$D$128)+$CD$118,\"E\")","v":"E"},{"$f":"IFERROR(((DO$98^2-$CU99^2)^0.5)+(7.99*2)-($AW$114+$AW$116),\"E\")","v":"E"},{"$f":"IFERROR(IF(CW99<=$CV99,\"E\",IF(CW99<=CQ133,\"E\",IF(CU99>=30,\"E\",\"\"))),\"E\")","v":"E"},{"$f":"IFERROR(((DP98^2-$CU$99^2)^0.5)+(7.99*2)-($AW$114+$AW$116),\"E\")","v":"E"},{"$f":"IFERROR(IF(CY99<=$CV99,\"E\",IF(CY99<=CQ133,\"E\",IF(CU99>=70,\"E\",\"\"))),\"E\")","v":"E"},{"$f":"IFERROR(((DQ98^2-$CU$99^2)^0.5)+(7.99*2)-($AW$114+$AW$116),\"E\")","v":"E"},{"$f":"IFERROR(IF(DA99<=$CV99,\"E\",IF(DA99<=CQ133,\"E\",IF(CU99<=35,\"E\",IF(CU99>=55,\"E\",\"\")))),\"E\")","v":"E"},{"$f":"IFERROR(((DR98^2-$CU$99^2)^0.5)+(7.99*2)-($AW$114+$AW$116),\"E\")","v":"E"},{"$f":"IFERROR(IF(DC99<=$CV99,\"E\",IF(DC99<=CQ133,\"E\",IF(CU99>=50,\"E\",\"\"))),\"E\")","v":"E"},{"$f":"IFERROR(((DS98^2-$CU$99^2)^0.5)+(7.99*2)-($AW$114+$AW$116),\"E\")","v":"E"},{"$f":"IFERROR(IF(DE99<=$CV99,\"E\",IF(DE99<=CQ133,\"E\",IF(CU99<=47,\"E\",IF(CU99>=72,\"E\",\"\")))),\"E\")","v":"E"},null,null,null,null,null,null,null,48.5,{"$f":"CW99","v":"E"},{"$f":"CY99","v":"E"},{"$f":"DA99","v":"E"},{"$f":"DC99","v":"E"},{"$f":"DE99","v":"E"}]
[null,"段　数",null,{"$f":"$F$23","v":0},null,"段",null,null,null,null,null,null,null,null,"上段",null,null,null,null,null,null,null,null,null,null,null,null,null,null,null,null,null,null,null,null,null,null,null,null,null,null,null,null,"平均Y",{"$f":"(AY103-(AU101+((AY106-1)*D102)))","v":{"$error":"#VALUE!"}},"最小Y",{"$f":"AY103-(AU104+AT98)","v":{"$error":"#VALUE!"}},null,"ア","イ","ウ","採用Y",{"$f":"IF(BA99=AS99,AS100,IF(BA99=AS102,AS105,IF(BA99=AS103,AS106,\"\")))","v":{"$error":"#VALUE!"}},null,"連結判定",{"$f":"IF(F90=\"\",\"△\",IF(COUNTIFS(BD96:BD98,\"*×*\")>0,\"×\",\"〇\"))","v":"△"},null,{"$f":"IF(V90=\"\",\"△\",IF(COUNTIFS(BF96:BF98,\"*×*\")>0,\"×\",\"〇\"))","v":"△"},null,null,null,null,null,null,null,null,null,null,null,"600",null,"1200",null,"ウェーブS",null,"900",null,"ウェーブ",null,null,null,null,"600",null,"1200",null,"ウェーブS",null,"900",null,"ウェーブ",null,null,null,null,null,"1200",{"$f":"IFERROR(IF(ROUNDDOWN(($F$23-($CE$119+$BQ$130))/2,0)<=0,\"×\",$AS$123-$CE$119),\"E\")","v":"E"},{"$f":"IFERROR(CT100*$D$127,\"E\")","v":"E"},{"$f":"IFERROR(((CT100-1)*$D$128)+$CE$118,\"E\")","v":"E"},{"$f":"IFERROR(((DO$98^2-$CU100^2)^0.5)+(7.99*2)-($AW$114+$AW$116),\"E\")","v":"E"},{"$f":"IFERROR(IF(CW100<=$CV100,\"E\",IF(CW100<=CX133,\"E\",IF(CU100>=30,\"E\",\"\"))),\"E\")","v":"E"},{"$f":"IFERROR(((DP$98^2-$CU100^2)^0.5)+(7.99*2)-($AW$114+$AW$116),\"E\")","v":"E"},{"$f":"IFERROR(IF(CY100<=$CV100,\"E\",IF(CY100<=CX133,\"E\",IF(CU100>=70,\"E\",\"\"))),\"E\")","v":"E"},{"$f":"IFERROR(((DQ$98^2-$CU100^2)^0.5)+(7.99*2)-($AW$114+$AW$116),\"E\")","v":"E"},{"$f":"IFERROR(IF(DA100<=$CV100,\"E\",IF(DA100<=CX133,\"E\",IF(CU100<=35,\"E\",IF(CU100>=55,\"E\",\"\")))),\"E\")","v":"E"},{"$f":"IFERROR(((DR$98^2-$CU100^2)^0.5)+(7.99*2)-($AW$114+$AW$116),\"E\")","v":"E"},{"$f":"IFERROR(IF(DC100<=$CV100,\"E\",IF(DC100<=CX133,\"E\",IF(CU100>=50,\"E\",\"\"))),\"E\")","v":"E"},{"$f":"IFERROR(((DS$98^2-$CU100^2)^0.5)+(7.99*2)-($AW$114+$AW$116),\"E\")","v":"E"},{"$f":"IFERROR(IF(DE100<=$CV100,\"E\",IF(DE100<=CX133,\"E\",IF(CU100<=47,\"E\",IF(CU100>=72,\"E\",\"\")))),\"E\")","v":"E"},null,null,2,"イ)ウ）総距離",null,null,null,108.5,{"$f":"CW100","v":"E"},{"$f":"CY100","v":"E"},{"$f":"DA100","v":"E"},{"$f":"DC100","v":"E"},{"$f":"DE100","v":"E"}]
[null,"蹴　上",null,{"$f":"$F$26","v":0},null,"㎝",null,null,null,null,null,null,null,null,{"$f":"IF(B90=\"\",\"未選択\",B90)","v":"シングル"},null,null,null,null,{"$f":"J89","v":""},null,null,null,null,null,null,null,null,null,null,null,null,null,null,null,null,null,null,null,null,null,null,null,null,null,"③F\nA上・B下",{"$f":"(((AX106+1)*D102)-(AX103+56))/2","v":{"$error":"#VALUE!"}},"最小ベース間距離",{"$f":"IF(F29=\"\",\"△\",AU104+((AW106-1)*F29))","v":"△"},{"$f":"IFERROR($AY$93-($AW$92+$AW$94),\"\")","v":""},{"$f":"IF(F29=\"\",\"△\",AU104+((AY106-1)*F29))","v":"△"},null,{"$f":"IFERROR(IF(AND(BS101=\"E\",BU101=\"E\",BW101=\"E\",BY101=\"E\",CA101=\"E\"),\"E\",IF(AND(CF101=\"E\",CH101=\"E\",CJ101=\"E\",CL101=\"E\",CN101=\"E\"),\"E\",\"\")),\"E\")","v":"E"},{"$f":"IFERROR(IF(AND(BS102=\"E\",BU102=\"E\",BW102=\"E\",BY102=\"E\",CA102=\"E\"),\"E\",IF(AND(CF102=\"E\",CH102=\"E\",CJ102=\"E\",CL102=\"E\",CN102=\"E\"),\"E\",\"\")),\"E\")","v":"E"},{"$f":"IFERROR(IF(AND(BS103=\"E\",BU103=\"E\",BW103=\"E\",BY103=\"E\",CA103=\"E\"),\"E\",IF(AND(CF103=\"E\",CH103=\"E\",CJ103=\"E\",CL103=\"E\",CN103=\"E\"),\"E\",\"\")),\"E\")","v":"E"},{"$f":"IFERROR(IF(AND(BS104=\"E\",BU104=\"E\",BW104=\"E\",BY104=\"E\",CA104=\"E\"),\"E\",IF(AND(CF104=\"E\",CH104=\"E\",CJ104=\"E\",CL104=\"E\",CN104=\"E\"),\"E\",\"\")),\"E\")","v":"E"},{"$f":"IFERROR(IF(AND(BS105=\"E\",BU105=\"E\",BW105=\"E\",BY105=\"E\",CA105=\"E\"),\"E\",IF(AND(CF105=\"E\",CH105=\"E\",CJ105=\"E\",CL105=\"E\",CN105=\"E\"),\"E\",\"\")),\"E\")","v":"E"},null,"連②シミュ","600","1200","ウェーブS","900","ウェーブ","連結②","600",{"$f":"IFERROR(ROUNDDOWN(($D$100-BH102)/2,0),\"\")","v":""},{"$f":"IFERROR(BO101*$D$101,\"\")","v":""},{"$f":"IFERROR(((BO101-1)*$D$102)+$BH$107,\"E\")","v":"E"},{"$f":"IFERROR(((DO$98^2-$BP101^2)^0.5)+(7.99*2)-($AW$90+$AW$92),\"E\")","v":"E"},{"$f":"IFERROR(IF(BR101<=$BQ101,\"E\",IF(BP101>=30,\"E\",\"\")),\"E\")","v":"E"},{"$f":"IFERROR(((DP$98^2-$BP101^2)^0.5)+(7.99*2)-($AW$90+$AW$92),\"E\")","v":"E"},{"$f":"IFERROR(IF(BT101<=$BQ101,\"E\",IF(BP101>=70,\"E\",\"\")),\"E\")","v":"E"},{"$f":"IFERROR(((DQ$98^2-$BP101^2)^0.5)+(7.99*2)-($AW$90+$AW$92),\"E\")","v":"E"},{"$f":"IFERROR(IF(BV101<=$BQ101,\"E\",IF(BP101<=35,\"E\",IF(BP101>=55,\"E\",\"\"))),\"E\")","v":"E"},{"$f":"IFERROR(((DR$98^2-$BP101^2)^0.5)+(7.99*2)-($AW$90+$AW$92),\"E\")","v":"E"},{"$f":"IFERROR(IF(BX101<=$BQ101,\"E\",IF(BP101>=50,\"E\",\"\")),\"E\")","v":"E"},{"$f":"IFERROR(((DS$98^2-$BP101^2)^0.5)+(7.99*2)-($AW$90+$AW$92),\"E\")","v":"E"},{"$f":"IFERROR(IF(BZ101<=$BQ101,\"E\",IF(BP101<=47,\"E\",IF(BP101>=72,\"E\",\"\"))),\"E\")","v":"E"},{"$f":"$D$100-(BH102+BO101)","v":{"$error":"#N/A"}},{"$f":"IFERROR(CB101*$D$101,\"\")","v":""},{"$f":"IFERROR(((CB101-1)*$D$102)+$BH$105,\"E\")","v":"E"},{"$f":"IFERROR(((DO$98^2-$CC101^2)^0.5)+(7.99*2)-($AW$94+$AW$96),\"E\")","v":"E"},{"$f":"IFERROR(IF(CE101<=$CD101,\"E\",IF(CC101>=30,\"E\",\"\")),\"E\")","v":"E"},{"$f":"IFERROR(((DP$98^2-$CC101^2)^0.5)+(7.99*2)-($AW$94+$AW$96),\"E\")","v":"E"},{"$f":"IFERROR(IF(CG101<=$CD101,\"E\",IF(CC101>=70,\"E\",\"\")),\"E\")","v":"E"},{"$f":"IFERROR(((DQ$98^2-$CC101^2)^0.5)+(7.99*2)-($AW$94+$AW$96),\"E\")","v":"E"},{"$f":"IFERROR(IF(CI101<=$CD101,\"E\",IF(CC101<=35,\"E\",IF(CC101>=55,\"E\",\"\"))),\"E\")","v":"E"},{"$f":"IFERROR(((DR$98^2-$CC101^2)^0.5)+(7.99*2)-($AW$94+$AW$96),\"E\")","v":"E"},{"$f":"IFERROR(IF(CK101<=$CD101,\"E\",IF(CC101>=50,\"E\",\"\")),\"E\")","v":"E"},{"$f":"IFERROR(((DS$98^2-$CC101^2)^0.5)+(7.99*2)-($AW$94+$AW$96),\"E\")","v":"E"},{"$f":"IFERROR(IF(CM101<=$CD101,\"E\",IF(CC101<=47,\"E\",IF(CC101>=72,\"E\",\"\"))),\"E\")","v":"E"},null,null,null,null,"ウェーブS",{"$f":"IFERROR(IF(ROUNDDOWN(($F$23-($CF$119+$BQ$130))/2,0)<=0,\"×\",$AS$123-$CF$119),\"E\")","v":"E"},{"$f":"IFERROR(CT101*$D$127,\"E\")","v":"E"},{"$f":"IFERROR(((CT101-1)*$D$128)+$CF$118,\"E\")","v":"E"},{"$f":"IFERROR(((DO$98^2-$CU101^2)^0.5)+(7.99*2)-($AW$114+$AW$116),\"E\")","v":"E"},{"$f":"IFERROR(IF(CW101<=$CV101,\"E\",IF(CW101<=DE133,\"E\",IF(CU101>=30,\"E\",\"\"))),\"E\")","v":"E"},{"$f":"IFERROR(((DP$98^2-$CU101^2)^0.5)+(7.99*2)-($AW$114+$AW$116),\"E\")","v":"E"},{"$f":"IFERROR(IF(CY101<=$CV101,\"E\",IF(CY101<=DE133,\"E\",IF(CU101>=70,\"E\",\"\"))),\"E\")","v":"E"},{"$f":"IFERROR(((DQ$98^2-$CU101^2)^0.5)+(7.99*2)-($AW$114+$AW$116),\"E\")","v":"E"},{"$f":"IFERROR(IF(DA101<=$CV101,\"E\",IF(DA101<=DE133,\"E\",IF(CU101<=35,\"E\",IF(CU101>=55,\"E\",\"\")))),\"E\")","v":"E"},{"$f":"IFERROR(((DR$98^2-$CU101^2)^0.5)+(7.99*2)-($AW$114+$AW$116),\"E\")","v":"E"},{"$f":"IFERROR(IF(DC101<=$CV101,\"E\",IF(DC101<=DE133,\"E\",IF(CU101>=50,\"E\",\"\"))),\"E\")","v":"E"},{"$f":"IFERROR(((DS$98^2-$CU101^2)^0.5)+(7.99*2)-($AW$114+$AW$116),\"E\")","v":"E"},{"$f":"IFERROR(IF(DE101<=$CV101,\"E\",IF(DE101<=DE133,\"E\",IF(CU101<=47,\"E\",IF(CU101>=72,\"E\",\"\")))),\"E\")","v":"E"},null,null,"③","イ)ウ）段数",null,null,null,95.903999999999996,{"$f":"CW101","v":"E"},{"$f":"CY101","v":"E"},{"$f":"DA101","v":"E"},{"$f":"DC101","v":"E"},{"$f":"DE101","v":"E"}]
[null,"踏　面",null,{"$f":"$F$29","v":0},null,"㎝",null,null,null,null,null,null,null,null,null,null,null,null,null,{"$f":"J90","v":"ショート"},null,null,null,{"$f":"R89","v":""},null,null,null,null,null,null,null,null,null,null,null,null,null,null,null,null,null,null,null,"上寄X",{"$f":"IF(AW103-(AU104+AU98)<0,\"\",AW103-(AU104+AU98))","v":{"$error":"#VALUE!"}},"⑪F\nA下・B上",{"$f":"(AX103-((AX106-1)*D102))/2","v":{"$error":"#VALUE!"}},"必要最大ﾍﾞｰｽ間",{"$f":"IF(F95=\"\",\"△\",(((123.084^2-F95^2)^0.5)+(7.99*2))-(10+7.5))","v":"△"},{"$f":"IF(I95=\"\",\"△\",(((123.084^2-I95^2)^0.5)+(7.99*2))-(10+7.5))","v":"△"},{"$f":"IF(L95=\"\",\"△\",(((123.084^2-L95^2)^0.5)+(7.99*2))-(10+7.5))","v":"△"},null,"600","1200","ウェーブS","900","ウェーブ",null,"イ)段数",{"$f":"BA104+1","v":{"$error":"#N/A"}},{"$f":"BB104+1","v":{"$error":"#N/A"}},{"$f":"BC104+1","v":{"$error":"#N/A"}},{"$error":"#N/A"},{"$error":"#N/A"},null,"1200",{"$f":"IFERROR(ROUNDDOWN(($D$100-BI102)/2,0),\"\")","v":""},{"$f":"IFERROR(BO102*$D$101,\"\")","v":""},{"$f":"IFERROR(((BO102-1)*$D$102)+$BI$107,\"E\")","v":"E"},{"$f":"IFERROR(((DO$98^2-$BP102^2)^0.5)+(7.99*2)-($AW$90+$AW$92),\"E\")","v":"E"},{"$f":"IFERROR(IF(BR102<=$BQ102,\"E\",IF(BP102>=30,\"E\",\"\")),\"E\")","v":"E"},{"$f":"IFERROR(((DP$98^2-$BP102^2)^0.5)+(7.99*2)-($AW$90+$AW$92),\"E\")","v":"E"},{"$f":"IFERROR(IF(BT102<=$BQ102,\"E\",IF(BP102>=70,\"E\",\"\")),\"E\")","v":"E"},{"$f":"IFERROR(((DQ$98^2-$BP102^2)^0.5)+(7.99*2)-($AW$90+$AW$92),\"E\")","v":"E"},{"$f":"IFERROR(IF(BV102<=$BQ102,\"E\",IF(BP102<=35,\"E\",IF(BP102>=55,\"E\",\"\"))),\"E\")","v":"E"},{"$f":"IFERROR(((DR$98^2-$BP102^2)^0.5)+(7.99*2)-($AW$90+$AW$92),\"E\")","v":"E"},{"$f":"IFERROR(IF(BX102<=$BQ102,\"E\",IF(BP102>=50,\"E\",\"\")),\"E\")","v":"E"},{"$f":"IFERROR(((DS$98^2-$BP102^2)^0.5)+(7.99*2)-($AW$90+$AW$92),\"E\")","v":"E"},{"$f":"IFERROR(IF(BZ102<=$BQ102,\"E\",IF(BP102<=47,\"E\",IF(BP102>=72,\"E\",\"\"))),\"E\")","v":"E"},{"$f":"$D$100-(BI102+BO102)","v":{"$error":"#N/A"}},{"$f":"IFERROR(CB102*$D$101,\"\")","v":""},{"$f":"IFERROR(((CB102-1)*$D$102)+$BI$105,\"E\")","v":"E"},{"$f":"IFERROR(((DO$98^2-$CC102^2)^0.5)+(7.99*2)-($AW$94+$AW$96),\"E\")","v":"E"},{"$f":"IFERROR(IF(CE102<=$CD102,\"E\",IF(CC102>=30,\"E\",\"\")),\"E\")","v":"E"},{"$f":"IFERROR(((DP$98^2-$CC102^2)^0.5)+(7.99*2)-($AW$94+$AW$96),\"E\")","v":"E"},{"$f":"IFERROR(IF(CG102<=$CD102,\"E\",IF(CC102>=70,\"E\",\"\")),\"E\")","v":"E"},{"$f":"IFERROR(((DQ$98^2-$CC102^2)^0.5)+(7.99*2)-($AW$94+$AW$96),\"E\")","v":"E"},{"$f":"IFERROR(IF(CI102<=$CD102,\"E\",IF(CC102<=35,\"E\",IF(CC102>=55,\"E\",\"\"))),\"E\")","v":"E"},{"$f":"IFERROR(((DR$98^2-$CC102^2)^0.5)+(7.99*2)-($AW$94+$AW$96),\"E\")","v":"E"},{"$f":"IFERROR(IF(CK102<=$CD102,\"E\",IF(CC102>=50,\"E\",\"\")),\"E\")","v":"E"},{"$f":"IFERROR(((DS$98^2-$CC102^2)^0.5)+(7.99*2)-($AW$94+$AW$96),\"E\")","v":"E"},{"$f":"IFERROR(IF(CM102<=$CD102,\"E\",IF(CC102<=47,\"E\",IF(CC102>=72,\"E\",\"\"))),\"E\")","v":"E"},null,null,null,null,"900",{"$f":"IFERROR(IF(ROUNDDOWN(($F$23-($CG$119+$BQ$130))/2,0)<=0,\"×\",$AS$123-$CG$119),\"E\")","v":"E"},{"$f":"IFERROR(CT102*$D$127,\"E\")","v":"E"},{"$f":"IFERROR(((CT102-1)*$D$128)+$CG$118,\"E\")","v":"E"},{"$f":"IFERROR(((DO$98^2-$CU102^2)^0.5)+(7.99*2)-($AW$114+$AW$116),\"E\")","v":"E"},{"$f":"IFERROR(IF(CW102<=$CV102,\"E\",IF(CW102<=DL133,\"E\",IF(CU102>=30,\"E\",\"\"))),\"E\")","v":"E"},{"$f":"IFERROR(((DP$98^2-$CU102^2)^0.5)+(7.99*2)-($AW$114+$AW$116),\"E\")","v":"E"},{"$f":"IFERROR(IF(CY102<=$CV102,\"E\",IF(CY102<=DL133,\"E\",IF(CU102>=70,\"E\",\"\"))),\"E\")","v":"E"},{"$f":"IFERROR(((DQ$98^2-$CU102^2)^0.5)+(7.99*2)-($AW$114+$AW$116),\"E\")","v":"E"},{"$f":"IFERROR(IF(DA102<=$CV102,\"E\",IF(DA102<=DL133,\"E\",IF(CU102<=35,\"E\",IF(CU102>=55,\"E\",\"\")))),\"E\")","v":"E"},{"$f":"IFERROR(((DR$98^2-$CU102^2)^0.5)+(7.99*2)-($AW$114+$AW$116),\"E\")","v":"E"},{"$f":"IFERROR(IF(DC102<=$CV102,\"E\",IF(DC102<=DL133,\"E\",IF(CU102>=50,\"E\",\"\"))),\"E\")","v":"E"},{"$f":"IFERROR(((DS$98^2-$CU102^2)^0.5)+(7.99*2)-($AW$114+$AW$116),\"E\")","v":"E"},{"$f":"IFERROR(IF(DE102<=$CV102,\"E\",IF(DE102<=DL133,\"E\",IF(CU102<=47,\"E\",IF(CU102>=72,\"E\",\"\")))),\"E\")","v":"E"},null,null,"④","イ)ウ）総踏面",null,null,null,78.5,{"$f":"CW102","v":"E"},{"$f":"CY102","v":"E"},{"$f":"DA102","v":"E"},{"$f":"DC102","v":"E"},{"$f":"DE102","v":"E"}]
[null,"【シミュレーション結果の各種TAISコード】",null,null,null,null,null,null,null,null,null,null,null,null,null,null,null,null,null,null,null,null,null,{"$f":"R90","v":"ショート"},null,null,null,null,"下段",null,{"$f":"IF(Z90=\"\",\"未選択\",IF(Z91=\"ショート不可\",\"不可\",Z90))","v":"シングル"},null,null,null,null,null,null,null,null,null,null,null,null,"下寄X",{"$f":"IF(AU105-(AU106+AS106)<0,\"\",AU105-(AU106+AS106))","v":{"$error":"#VALUE!"}},"③F-⑪F",{"$f":"IF(AU101-AU102<0,0,AU101-AU102)","v":{"$error":"#VALUE!"}},"ベース間距離",{"$f":"IFERROR($AY$91-($AW$90+$AW$92),\"\")","v":""},{"$f":"IFERROR($AY$93-($AW$92+$AW$94),\"\")","v":""},{"$f":"IFERROR($AY$95-($AW$94+$AW$96),\"\")","v":""},null,48.5,108.5,95.903999999999996,78.5,123.084,null,"イ)段差",{"$f":"BH102*$D$101","v":{"$error":"#N/A"}},{"$f":"BI102*$D$101","v":{"$error":"#N/A"}},{"$error":"#N/A"},{"$error":"#N/A"},{"$error":"#N/A"},null,"ウェーブS",{"$f":"IFERROR(ROUNDDOWN(($D$100-BJ102)/2,0),\"\")","v":""},"",{"$f":"IFERROR(((BO103-1)*$D$102)+$BJ$107,\"E\")","v":"E"},{"$f":"IFERROR(((DO$98^2-$BP103^2)^0.5)+(7.99*2)-($AW$90+$AW$92),\"E\")","v":"E"},"E",{"$f":"IFERROR(((DP$98^2-$BP103^2)^0.5)+(7.99*2)-($AW$90+$AW$92),\"E\")","v":"E"},"E",{"$f":"IFERROR(((DQ$98^2-$BP103^2)^0.5)+(7.99*2)-($AW$90+$AW$92),\"E\")","v":"E"},"E",{"$f":"IFERROR(((DR$98^2-$BP103^2)^0.5)+(7.99*2)-($AW$90+$AW$92),\"E\")","v":"E"},"E",{"$f":"IFERROR(((DS$98^2-$BP103^2)^0.5)+(7.99*2)-($AW$90+$AW$92),\"E\")","v":"E"},"E",{"$f":"$D$100-(BJ102+BO103)","v":{"$error":"#N/A"}},"",{"$f":"IFERROR(((CB103-1)*$D$102)+$BJ$105,\"E\")","v":"E"},{"$f":"IFERROR(((DO$98^2-$CC103^2)^0.5)+(7.99*2)-($AW$94+$AW$96),\"E\")","v":"E"},"E",{"$f":"IFERROR(((DP$98^2-$CC103^2)^0.5)+(7.99*2)-($AW$94+$AW$96),\"E\")","v":"E"},"E",{"$f":"IFERROR(((DQ$98^2-$CC103^2)^0.5)+(7.99*2)-($AW$94+$AW$96),\"E\")","v":"E"},"E",{"$f":"IFERROR(((DR$98^2-$CC103^2)^0.5)+(7.99*2)-($AW$94+$AW$96),\"E\")","v":"E"},"E",{"$f":"IFERROR(((DS$98^2-$CC103^2)^0.5)+(7.99*2)-($AW$94+$AW$96),\"E\")","v":"E"},"E",null,null,null,null,"ウェーブ",{"$f":"IFERROR(IF(ROUNDDOWN(($F$23-($CH$119+$BQ$130))/2,0)<=0,\"×\",$AS$123-$CH$119),\"E\")","v":"E"},{"$f":"IFERROR(CT103*$D$127,\"E\")","v":"E"},{"$f":"IFERROR(((CT103-1)*$D$128)+$CH$118,\"E\")","v":"E"},{"$f":"IFERROR(((DO$98^2-$CU103^2)^0.5)+(7.99*2)-($AW$114+$AW$116),\"E\")","v":"E"},{"$f":"IFERROR(IF(CW103<=$CV103,\"E\",IF(CW103<=DS133,\"E\",IF(CU103>=30,\"E\",\"\"))),\"E\")","v":"E"},{"$f":"IFERROR(((DP$98^2-$CU103^2)^0.5)+(7.99*2)-($AW$114+$AW$116),\"E\")","v":"E"},{"$f":"IFERROR(IF(CY103<=$CV103,\"E\",IF(CY103<=DS133,\"E\",IF(CU103>=70,\"E\",\"\"))),\"E\")","v":"E"},{"$f":"IFERROR(((DQ$98^2-$CU103^2)^0.5)+(7.99*2)-($AW$114+$AW$116),\"E\")","v":"E"},{"$f":"IFERROR(IF(DA103<=$CV103,\"E\",IF(DA103<=DS133,\"E\",IF(CU103<=35,\"E\",IF(CU103>=55,\"E\",\"\")))),\"E\")","v":"E"},{"$f":"IFERROR(((DR$98^2-$CU103^2)^0.5)+(7.99*2)-($AW$114+$AW$116),\"E\")","v":"E"},{"$f":"IFERROR(IF(DC103<=$CV103,\"E\",IF(DC103<=DS133,\"E\",IF(CU103>=50,\"E\",\"\"))),\"E\")","v":"E"},{"$f":"IFERROR(((DS$98^2-$CU103^2)^0.5)+(7.99*2)-($AW$114+$AW$116),\"E\")","v":"E"},{"$f":"IFERROR(IF(DE103<=$CV103,\"E\",IF(DE103<=DS133,\"E\",IF(CU103<=47,\"E\",IF(CU103>=72,\"E\",\"\")))),\"E\")","v":"E"},null,null,null,null,null,null,null,123.084,{"$f":"CW103","v":"E"},{"$f":"CY103","v":"E"},{"$f":"DA103","v":"E"},{"$f":"DC103","v":"E"},{"$f":"DE103","v":"E"}]
[null,null,null,null,null,null,null,null,null,null,null,null,null,null,null,null,null,null,null,null,null,null,null,null,null,null,null,null,null,null,null,null,null,null,null,null,null,null,null,null,null,null,null,"MIN",{"$f":"MIN(AS102:AS103)","v":{"$error":"#VALUE!"}},"MIN",{"$f":"MIN(AU101:AU103)","v":{"$error":"#VALUE!"}},"最小斜辺",{"$f":"IFERROR(( AW105^2 +F95^2)^0.5,\"\")","v":""},{"$f":"IFERROR(( AX105^2 +I95^2)^0.5,\"\")","v":""},{"$f":"IFERROR(( AY105^2 +L95^2)^0.5,\"\")","v":""},null,{"$f":"INDEX('S+Sﾁｪｯｸ表'!$D$6:$AG$28, MATCH($F$29,'S+Sﾁｪｯｸ表'!$C$6:$C$28,0), MATCH($F$26,'S+Sﾁｪｯｸ表'!$D$5:$AG$5,0))","v":{"$error":"#N/A"}},{"$f":"INDEX('S+Sﾁｪｯｸ表'!$D$60:$AG$82, MATCH($F$29,'S+Sﾁｪｯｸ表'!$C$60:$C$82,0), MATCH($F$26,'S+Sﾁｪｯｸ表'!$D$59:$AG$59,0))","v":{"$error":"#N/A"}},{"$f":"INDEX('S+Sﾁｪｯｸ表'!$D$87:$AG$109, MATCH($F$29,'S+Sﾁｪｯｸ表'!$C$87:$C$109,0), MATCH($F$26,'S+Sﾁｪｯｸ表'!$D$86:$AG$86,0))","v":{"$error":"#N/A"}},{"$f":"INDEX('S+Sﾁｪｯｸ表'!$D$33:$AG$55, MATCH($F$29,'S+Sﾁｪｯｸ表'!$C$33:$C$55,0), MATCH($F$26,'S+Sﾁｪｯｸ表'!$D$32:$AG$32,0))","v":{"$error":"#N/A"}},{"$f":"INDEX('S+Sﾁｪｯｸ表'!$D$114:$AG$136, MATCH($F$29,'S+Sﾁｪｯｸ表'!$C$114:$C$136,0), MATCH($F$26,'S+Sﾁｪｯｸ表'!$D$113:$AG$113,0))","v":{"$error":"#N/A"}},null,"イ)ベ距離",{"$f":"IFERROR((((BA103^2-BH103^2)^0.5)+(7.99*2))-($AW$92+$AW$94),\"\")","v":""},{"$f":"IFERROR((((BB103^2-BI103^2)^0.5)+(7.99*2))-($AW$92+$AW$94),\"\")","v":""},"",{"$f":"IFERROR((((BD103^2-BK103^2)^0.5)+(7.99*2))-($AW$92+$AW$94),\"\")","v":""},{"$f":"IFERROR((((BE103^2-BL103^2)^0.5)+(7.99*2))-($AW$92+$AW$94),\"\")","v":""},null,"900",{"$f":"IFERROR(ROUNDDOWN(($D$100-BK102)/2,0),\"\")","v":""},{"$f":"IFERROR(BO104*$D$101,\"\")","v":""},{"$f":"IFERROR(((BO104-1)*$D$102)+$BK$107,\"E\")","v":"E"},{"$f":"IFERROR(((DO$98^2-$BP104^2)^0.5)+(7.99*2)-($AW$90+$AW$92),\"E\")","v":"E"},"E",{"$f":"IFERROR(((DP$98^2-$BP104^2)^0.5)+(7.99*2)-($AW$90+$AW$92),\"E\")","v":"E"},{"$f":"IFERROR(IF(BT104<=$BQ104,\"E\",IF(BP104>=70,\"E\",\"\")),\"E\")","v":"E"},{"$f":"IFERROR(((DQ$98^2-$BP104^2)^0.5)+(7.99*2)-($AW$90+$AW$92),\"E\")","v":"E"},"E",{"$f":"IFERROR(((DR$98^2-$BP104^2)^0.5)+(7.99*2)-($AW$90+$AW$92),\"E\")","v":"E"},"E",{"$f":"IFERROR(((DS$98^2-$BP104^2)^0.5)+(7.99*2)-($AW$90+$AW$92),\"E\")","v":"E"},"E",{"$f":"$D$100-(BK102+BO104)","v":{"$error":"#N/A"}},{"$f":"IFERROR(CB104*$D$101,\"\")","v":""},{"$f":"IFERROR(((CB104-1)*$D$102)+$BK$105,\"E\")","v":"E"},{"$f":"IFERROR(((DO$98^2-$CC104^2)^0.5)+(7.99*2)-($AW$94+$AW$96),\"E\")","v":"E"},{"$f":"IFERROR(IF(CE104<=$CD104,\"E\",IF(CC104>=30,\"E\",\"\")),\"E\")","v":"E"},{"$f":"IFERROR(((DP$98^2-$CC104^2)^0.5)+(7.99*2)-($AW$94+$AW$96),\"E\")","v":"E"},"E",{"$f":"IFERROR(((DQ$98^2-$CC104^2)^0.5)+(7.99*2)-($AW$94+$AW$96),\"E\")","v":"E"},"E",{"$f":"IFERROR(((DR$98^2-$CC104^2)^0.5)+(7.99*2)-($AW$94+$AW$96),\"E\")","v":"E"},"E",{"$f":"IFERROR(((DS$98^2-$CC104^2)^0.5)+(7.99*2)-($AW$94+$AW$96),\"E\")","v":"E"},"E",null,null,null,null,null,null,"可能な連結①",null,null,{"$f":"IF(COUNTIFS(CX99:CX103,\"\")>0,\"600\",\"×\")","v":"×"},null,{"$f":"IF(COUNTIFS(CZ99:CZ103,\"\")>0,\"1200\",\"×\")","v":"×"},null,{"$f":"IF(COUNTIFS(DB99:DB103,\"\")>0,\"ウェーブS\",\"×\")","v":"×"},null,{"$f":"IF(COUNTIFS(DD99:DD103,\"\")>0,\"900\",\"×\")","v":"×"},null,{"$f":"IF(COUNTIFS(DF99:DF103,\"\")>0,\"ウェーブ\",\"×\")","v":"×"}]
[null,{"$f":"IF(OR(F86=\"×\",F86=\"\",F86=\"△\"),\"\",IF(OR(B90=\"\",F90=\"\"),\"\",IF(OR(B90=\"ダブル\",B90=\"ショートダブル\"),B90&\"＋連結バー\"&F90&\" 2本セット\",B90&\"+連結バー\"&F90&\" セット\")))","v":""},null,null,null,null,null,null,null,{"$f":"IF(OR(F86=\"×\",F86=\"\",F86=\"△\"),\"\",IF(OR(J90=\"\",N90=\"\"),\"\",IF(OR(J90=\"ダブル\",J90=\"ショートダブル\"),J90&\"＋連結バー\"&N90&\" 2本セット\",J90&\"+連結バー\"&N90&\" セット\")))","v":""},null,null,null,null,null,null,null,{"$f":"IF(OR(F86=\"×\",F86=\"\",F86=\"△\"),\"\",IF(OR(R90=\"\",V90=\"\"),\"\",IF(OR(R90=\"ダブル\",R90=\"ショートダブル\"),R90&\"＋連結バー\"&V90&\" 2本セット\",R90&\"+連結バー\"&V90&\" セット\")))","v":""},null,null,null,null,null,null,null,{"$f":"IF(OR(F86=\"×\",F86=\"\",F86=\"△\"),\"\",IF(Z90=\"\",\"\",Z90&\" ※単体\"))","v":""},null,null,null,null,null,null,null,null,null,null,null,null,null,null,null,null,null,"上寄Y",{"$f":"AU105-(AU106+AS102)","v":{"$error":"#VALUE!"}},"ｱｲｳ\n総ﾍﾞ距離",{"$f":"AW103+AX103+AY103+AZ92+AZ94","v":{"$error":"#VALUE!"}},"最小底辺",{"$f":"(AW101+AW90+AW92)-(7.99*2)","v":{"$error":"#VALUE!"}},{"$f":"(AX101+AW92+AW94)-(7.99*2)","v":{"$error":"#VALUE!"}},{"$f":"(AY101+AW94+AW96)-(7.99*2)","v":{"$error":"#VALUE!"}},null,{"$f":"IF(OR(BA104=\"×\",BA101=\"E\",BA106=\"×\"),\"※設置不可\",\"設置可能\")","v":{"$error":"#N/A"}},{"$f":"IF(OR(BB104=\"×\",BB101=\"E\",BB106=\"×\"),\"※設置不可\",\"設置可能\")","v":{"$error":"#N/A"}},{"$error":"#N/A"},{"$error":"#N/A"},{"$error":"#N/A"},{"$f":"IFERROR(INDEX($BA$104:$BE$104, MATCH(N90,$BA$102:$BE$102,0)),\"×\")","v":"×"},"③F幅",{"$f":"IFERROR((((BH102+1)*$D$102)-(BH104+56))/2,\"\")","v":""},{"$f":"IFERROR((((BI102+1)*$D$102)-(BI104+56))/2,\"\")","v":""},"","",{"$f":"IFERROR((((BL102+1)*$D$102)-(BL104+56))/2,\"\")","v":""},null,"ウェーブ",{"$f":"IFERROR(ROUNDDOWN(($D$100-BL102)/2,0),\"\")","v":""},"",{"$f":"IFERROR(((BO105-1)*$D$102)+$BL$107,\"E\")","v":"E"},{"$f":"IFERROR(((DO$98^2-$BP105^2)^0.5)+(7.99*2)-($AW$90+$AW$92),\"E\")","v":"E"},"E",{"$f":"IFERROR(((DP$98^2-$BP105^2)^0.5)+(7.99*2)-($AW$90+$AW$92),\"E\")","v":"E"},"E",{"$f":"IFERROR(((DQ$98^2-$BP105^2)^0.5)+(7.99*2)-($AW$90+$AW$92),\"E\")","v":"E"},"E",{"$f":"IFERROR(((DR$98^2-$BP105^2)^0.5)+(7.99*2)-($AW$90+$AW$92),\"E\")","v":"E"},{"$f":"IFERROR(IF(BX105<=$BQ105,\"E\",IF(BP105>=50,\"E\",\"\")),\"E\")","v":"E"},{"$f":"IFERROR(((DS$98^2-$BP105^2)^0.5)+(7.99*2)-($AW$90+$AW$92),\"E\")","v":"E"},"E",{"$f":"$D$100-(BL102+BO105)","v":{"$error":"#N/A"}},"",{"$f":"IFERROR(((CB105-1)*$D$102)+$BL$105,\"E\")","v":"E"},{"$f":"IFERROR(((DO$98^2-$CC105^2)^0.5)+(7.99*2)-($AW$94+$AW$96),\"E\")","v":"E"},"E",{"$f":"IFERROR(((DP$98^2-$CC105^2)^0.5)+(7.99*2)-($AW$94+$AW$96),\"E\")","v":"E"},"E",{"$f":"IFERROR(((DQ$98^2-$CC105^2)^0.5)+(7.99*2)-($AW$94+$AW$96),\"E\")","v":"E"},"E",{"$f":"IFERROR(((DR$98^2-$CC105^2)^0.5)+(7.99*2)-($AW$94+$AW$96),\"E\")","v":"E"},"E",{"$f":"IFERROR(((DS$98^2-$CC105^2)^0.5)+(7.99*2)-($AW$94+$AW$96),\"E\")","v":"E"},{"$f":"IFERROR(IF(CM105<=$CD105,\"E\",IF(CC105<=47,\"E\",IF(CC105>=72,\"E\",\"\"))),\"E\")","v":"E"},null,null,null,null,null,null,null,null,null,{"$f":"IF(CX104=\"×\",\"\",DO98)","v":""},null,{"$f":"IF(CZ104=\"×\",\"\",DP98)","v":""},null,{"$f":"IF(DB104=\"×\",\"\",DQ98)","v":""},null,{"$f":"IF(DD104=\"×\",\"\",DR98)","v":""},null,{"$f":"IF(DF104=\"×\",\"\",DS98)","v":""}]
[null,{"$f":"IFERROR(IF(OR(F86=\"×\",F86=\"\",F86=\"△\"),\"\",INDEX(TAISﾘｽﾄ!$B$3:$L$19,MATCH(B90,TAISﾘｽﾄ!$A$3:$A$19,0),MATCH(F90,TAISﾘｽﾄ!$B$2:$L$2,0))),\"\")","v":""},null,null,null,null,null,null,null,{"$f":"IFERROR(IF(OR(F86=\"×\",F86=\"\",F86=\"△\"),\"\",INDEX(TAISﾘｽﾄ!$B$3:$L$19,MATCH(J90,TAISﾘｽﾄ!$A$3:$A$19,0),MATCH(N90,TAISﾘｽﾄ!$B$2:$L$2,0))),\"\")","v":""},null,null,null,null,null,null,null,{"$f":"IFERROR(IF(OR(F86=\"×\",F86=\"\",F86=\"△\"),\"\",INDEX(TAISﾘｽﾄ!$B$3:$L$19,MATCH(R90,TAISﾘｽﾄ!$A$3:$A$19,0),MATCH(V90,TAISﾘｽﾄ!$B$2:$L$2,0))),\"\")","v":""},null,null,null,null,null,null,null,{"$f":"IFERROR(IF(OR(F86=\"×\",F86=\"\",F86=\"△\"),\"\",INDEX(TAISﾘｽﾄ!B3:B19,MATCH(Z90,TAISﾘｽﾄ!A3:A19,0))),\"\")","v":""},null,null,null,null,null,null,null,null,null,null,null,null,null,null,null,null,null,"下寄Y",{"$f":"AY103-(AU104+AT98)","v":{"$error":"#VALUE!"}},"ｱｲｳ\n総踏面",{"$f":"(D100-1)*D102","v":0},"段　数",{"$f":"IF(ROUNDDOWN(($F$23-AX106)/2,0)<=0,\"×\",ROUNDDOWN(($F$23-AX106)/2,0))","v":{"$error":"#VALUE!"}},{"$f":"IFERROR(LEFT(BF105,1)+1,\"\")","v":""},{"$f":"IFERROR(F23-AX106-AW106,\"\")","v":""},null,{"$f":"IF(BA104=\"×\",\"×\",IF(ROUNDDOWN(($F$23-(BA104+1))/2,0)<=0,\"×\",\"○\"))","v":{"$error":"#N/A"}},{"$f":"IF(BB104=\"×\",\"×\",IF(ROUNDDOWN(($F$23-(BB104+1))/2,0)<=0,\"×\",\"○\"))","v":{"$error":"#N/A"}},{"$f":"IF(BC104=\"×\",\"×\",IF(ROUNDDOWN(($F$23-(BC104+1))/2,0)<=0,\"×\",\"○\"))","v":{"$error":"#N/A"}},{"$f":"IF(BD104=\"×\",\"×\",IF(ROUNDDOWN(($F$23-(BD104+1))/2,0)<=0,\"×\",\"○\"))","v":{"$error":"#N/A"}},{"$f":"IF(BE104=\"×\",\"×\",IF(ROUNDDOWN(($F$23-(BE104+1))/2,0)<=0,\"×\",\"○\"))","v":{"$error":"#N/A"}},null,"⑪F幅",{"$f":"$D$102-28-BH105","v":{"$error":"#VALUE!"}},{"$f":"$D$102-28-BI105","v":{"$error":"#VALUE!"}},{"$f":"$D$102-28-BJ105","v":{"$error":"#VALUE!"}},{"$error":"#VALUE!"},{"$f":"$D$102-28-BL105","v":{"$error":"#VALUE!"}},null,null,null,"可能な連結①",null,null,{"$f":"IF(COUNTIFS(BS101:BS105,\"\")>0,\"600\",\"×\")","v":"×"},null,{"$f":"IF(COUNTIFS(BU101:BU105,\"\")>0,\"1200\",\"×\")","v":"×"},null,{"$f":"IF(COUNTIFS(BW101:BW105,\"\")>0,\"ウェーブS\",\"×\")","v":"×"},null,{"$f":"IF(COUNTIFS(BY101:BY105,\"\")>0,\"900\",\"×\")","v":"×"},null,{"$f":"IF(COUNTIFS(CA101:CA105,\"\")>0,\"ウェーブ\",\"×\")","v":"×"},null,"可能な連結①",null,null,{"$f":"IF(COUNTIFS(CF101:CF105,\"\")>0,\"600\",\"×\")","v":"×"},null,{"$f":"IF(COUNTIFS(CH101:CH105,\"\")>0,\"1200\",\"×\")","v":"×"},null,{"$f":"IF(COUNTIFS(CJ101:CJ105,\"\")>0,\"ウェーブS\",\"×\")","v":"×"},null,{"$f":"IF(COUNTIFS(CL101:CL105,\"\")>0,\"900\",\"×\")","v":"×"},null,{"$f":"IF(COUNTIFS(CN101:CN105,\"\")>0,\"ウェーブ\",\"×\")","v":"×"}]
[null,null,null,null,null,null,null,null,null,null,null,null,null,null,null,null,null,null,null,null,null,null,null,null,null,null,null,null,null,null,null,null,null,null,null,null,null,null,null,null,null,null,null,null,null,null,null,null,null,null,null,null,null,null,null,null,null,null,"F",{"$f":"MIN(BH105:BH106)","v":{"$error":"#VALUE!"}},{"$f":"IFERROR(MIN(BI105:BI106),\"\")","v":""},{"$f":"IFERROR(MIN(BJ105:BJ106),\"\")","v":""},{"$f":"IFERROR(MIN(BK105:BK106),\"\")","v":""},{"$f":"IFERROR(MIN(BL105:BL106),\"\")","v":""},null,null,null,null,null,null,null,null,null,null,null,null,null,null,null,null,null,"D連結③シミュレーション",null,null,null,null,null,"連結②",null,600,null,null,"の場合",null,"連結②",null,1200,null,null,"の場合",null,"連結②",null,"ウェーブS",null,null,"の場合",null,"連結②",null,900,null,null,"の場合",null,"連結②",null,"ウェーブ",null,null,"の場合"]
[]
[]
[]
[null,null,null,null,null,null,null,null,null,null,null,null,null,null,null,null,null,null,null,null,null,null,null,null,null,null,null,null,null,null,null,null,null,null,null,null,null,null,null,null,null,null,null,null,null,null,null,null,null,null,null,null,null,null,"斜辺",48.5,78.5,95.903999999999996,108.5,123.084]
[null,null,null,null,null,{"$f":"IF(OR(F23=\"\",F26=\"\",F29=\"\"),\"\",IF(AND(D113=\"×\",E113=\"〇\"),\"△\",IF(AND(C113=\"×\",E113=\"〇\"),\"△\",IF(OR(P119=\"△\",X119=\"△\"),\"△\",IF(COUNTIFS(AL113:AP118,\"*×*\")>0,\"×\",\"〇\")))))","v":""},null,null,null,null,null,null,null,null,null,null,null,null,null,null,null,null,null,null,null,null,null,null,null,null,null,null,null,null,null,null,null,null,null,null,null,null,null,null,null,null,null,"【中継ショート３台】必要数値",null,null,null,null,null,null,null,"☆600 ","☆900 ","☆ウェーブS ","☆1200 ","☆ウェーブ ",null,null,null,null,null,null,null,null,null,null,null,null,null,null,null,null,null,null,null,null,null,null,null,null,null,null,null,null,null,"600","1200","ウェーブS","900","ウェーブ",null,null,"600","1200","ウェーブS","900","ウェーブ",null,null,"600","1200","ウェーブS","900","ウェーブ",null,null,"600","1200","ウェーブS","900","ウェーブ",null,null,"600","1200","ウェーブS","900","ウェーブ"]
[null,{"$f":"IF(OR($F$23=\"\",$F$26=\"\",$F$29=\"\"),\"\",\"〇\")","v":""},{"$f":"IF(OR(AH119=\"×\",B119=\"×\"),\"×\",\"〇\")","v":"〇"},{"$f":"IF(OR(N119=\"×\",V119=\"×\",F119=\"×\",AD119=\"×\"),\"×\",\"〇\")","v":"〇"},{"$f":"IF(AND(O119=\"〇\",W119=\"〇\",G119=\"〇\",AE119=\"〇\"),\"〇\",\"×\")","v":"〇"},{"$f":"IF(F112=\"△\",\"※一部製品を変更すると設置可能です。対象品は緑で表示されております。\",\"\")","v":""},null,null,null,null,null,null,null,null,null,null,null,null,null,null,null,null,null,null,null,null,null,null,null,null,null,null,null,null,null,null,null,{"$f":"IF(N116=\"\",\"\",IF(O119=\"〇\",\"〇\",IF(F118=\"ナシ\",\"×\",\"〇\")))","v":""},{"$f":"IF(N118=\"ナシ\",\"×\",\"〇\")","v":"〇"},{"$f":"IF(O119=\"〇\",\"〇\",IF(V118=\"ナシ\",\"×\",\"〇\"))","v":"〇"},{"$f":"IF(OR(N116=\"\",V116=\"\"),\"\",IF(O119=\"〇\",\"〇\",IF(AD118=\"ナシ\",\"×\",\"〇\")))","v":""},null,null,null,null,null,null,null,"⑤","①","取付け支柱間距離","ベースサイズ","連結バー角度",null,"段差",30,50,"35~55",70,"47~72",null,null,null,null,null,null,null,null,null,null,null,null,null,"エ)段数",{"$f":"BQ131","v":{"$error":"#VALUE!"}},null,null,null,null,null,null,null,null,null,null,null,null,"ウ)段数",null,{"$f":"$AS$122-$BQ$131","v":{"$error":"#VALUE!"}},{"$f":"$AS$122-$BQ$131","v":{"$error":"#VALUE!"}},{"$error":"#VALUE!"},{"$error":"#VALUE!"},{"$error":"#VALUE!"},"ウ)段数",null,{"$f":"CL113","v":{"$error":"#VALUE!"}},{"$f":"CM113","v":{"$error":"#VALUE!"}},{"$error":"#VALUE!"},{"$error":"#VALUE!"},{"$error":"#VALUE!"},"ウ)段数",null,{"$f":"CS113","v":{"$error":"#VALUE!"}},{"$error":"#VALUE!"},{"$error":"#VALUE!"},{"$error":"#VALUE!"},{"$error":"#VALUE!"},"ウ)段数",null,{"$f":"CZ113","v":{"$error":"#VALUE!"}},{"$error":"#VALUE!"},{"$error":"#VALUE!"},{"$error":"#VALUE!"},{"$f":"DD113","v":{"$error":"#VALUE!"}},"ウ)段数",null,{"$f":"DG113","v":{"$error":"#VALUE!"}},{"$error":"#VALUE!"},{"$error":"#VALUE!"},{"$error":"#VALUE!"},{"$error":"#VALUE!"}]
[null,"【組み合わせシミュレーション】",null,null,null,null,null,null,null,null,null,null,null,null,null,null,null,null,null,null,null,null,null,null,null,null,null,null,null,null,null,null,null,null,null,null,null,{"$f":"IF(B117=\"\",\"〇\",IF(OR(B117=\"手すりを選択\",B117=\"製品を変更\"),\"△\",\"×\"))","v":"〇"},{"$f":"IF(J117=\"\",\"〇\",IF(J117=\"手すりを選択\",\"△\",\"×\"))","v":"〇"},{"$f":"IF(R117=\"\",\"〇\",IF(R117=\"手すりを選択\",\"△\",\"×\"))","v":"〇"},{"$f":"IF(Z117=\"\",\"〇\",IF(Z117=\"手すりを選択\",\"△\",\"×\"))","v":"〇"},{"$f":"IF(AH117=\"\",\"〇\",IF(AH117=\"手すりを選択\",\"△\",\"×\"))","v":"〇"},null,"シングル",{"$f":"IF(AU121=\"△\",\"\",IF(OR(B116=AR114,B116=AR116,B116=AR117),AR114,\"\"))","v":"シングル"},{"$f":"IF($AS$121=\"△\",\"\",AR114)","v":"シングル"},"上段","リ①",{"$f":"IF(ISBLANK(B116),\"△\",VLOOKUP(B116,固定数値!E:F,2,0))","v":10},"―","―",{"$f":"IF(ISBLANK(B116),\"△\",VLOOKUP(B116,固定数値!G:H,2,0))","v":49.5},"―",null,"連結１",{"$f":"IFERROR(IF(BD115<=$AW$128,\"\",IF($F$121<=BD113,BD112,\"\")),\"\")","v":""},{"$f":"IFERROR(IF(BE115<=$AW$128,\"\",IF($F$121<=BE113,BE112,\"\")),\"\")","v":""},{"$f":"IFERROR(IF(BF115<=$AW$128,\"\",IF($F$121>=55,\"\",IF($F$121>=35,BF112,\"\"))),\"\")","v":""},{"$f":"IFERROR(IF(BG115<=$AW$128,\"\",IF($F$121<=BG113,BG112,\"\")),\"\")","v":""},{"$f":"IFERROR(IF(BH115<=$AW$128,\"\",IF($F$121>=72,\"\",IF($F$121>=47,BH112,\"\"))),\"\")","v":""},"連結①",{"$f":"IF(BD114=\"\",\"\",\"600\")","v":""},{"$f":"IF(BE114=\"\",\"\",\"900\")","v":""},{"$f":"IF(BG114=\"\",\"\",\"1200\")","v":""},{"$f":"IF(BF114=\"\",\"\",\"ウェーブS\")","v":""},{"$f":"IF(BH114=\"\",\"\",\"ウェーブ\")","v":""},null,null,null,null,null,null,null,"エ)段差",{"$f":"D127*BW113","v":{"$error":"#VALUE!"}},null,null,null,null,null,null,null,null,null,null,null,null,"ウ)段差",null,{"$f":"IFERROR(IF(CL113*$D$127<=30,CL113*$D$127,\"×\"),\"E\")","v":"E"},{"$f":"IFERROR(IF(CM113*$D$127<=70,CM113*$D$127,\"×\"),\"E\")","v":"E"},{"$f":"IFERROR(IF(CN113*$D$127>=55,\"×\",IF(CN113*$D$127>=35,CN113*$D$127,\"×\")),\"E\")","v":"E"},{"$f":"IFERROR(IF(CO113*$D$127<=50,CO113*$D$127,\"×\"),\"E\")","v":"E"},{"$f":"IFERROR(IF(CP113*$D$127>=72,\"×\",IF(CP113*$D$127>=47,CP113*$D$127,\"×\")),\"E\")","v":"E"},"ウ)段差",null,"E","E","E","E","E","ウ)段差",null,"E","E","E","E","E","ウ)段差",null,"E","E","E","E","E","ウ)段差",null,"E","E","E","E","E"]
[null,"上段",null,null,null,"連結①",null,null,null,{"$f":"IFERROR(IF(B113=\"\",\"\",IF(COUNTIFS(AL115:AO116,\"×\")>0,\"×\",$F$23-AW126)),\"―\")","v":""},null,null,null,"連結②",null,null,null,{"$f":"IFERROR(IF(B113=\"\",\"\",IF(COUNTIFS(AL115:AO116,\"×\")>0,\"×\",IF($F$23-AX133-AW126<=0,\"×\",$F$23-AX133-AW126))),\"―\")","v":""},null,null,null,"連結③",null,null,null,{"$f":"IFERROR(IF(B113=\"\",\"\",IF(COUNTIFS(AL115:AO116,\"×\")>0,\"×\",IF(($F$23-AX133-AW126-AY133)<=0,\"×\",$F$23-AX133-AW126-AY133))),\"―\")","v":""},null,null,null,"連結④",null,null,null,"下段",null,null,null,{"$f":"IF($F$23=\"\",\"×\",IF($F$23<=3,\"×\",\"〇\"))","v":"×"},{"$f":"IF($F$26=\"\",\"×\",IF(OR(F26<1,F26>30),\"×\",\"〇\"))","v":"×"},{"$f":"IF($F$29=\"\",\"×\",IF(OR(F29<28,F29>50),\"×\",IF(F29=0,\"×\",\"〇\")))","v":"×"},null,{"$f":"IFERROR(IF(CR146<CH148,\"×\",\"〇\"),\"E\")","v":"E"},null,"ダブル",{"$f":"IF(AU121=\"△\",\"\",IF(OR(B116=AR115,B116=AR118),AR115,\"\"))","v":""},{"$f":"IF($AS$121=\"△\",\"\",AR115)","v":"ダブル"},null,"連①","―",{"$f":"IF(ISBLANK(F116),\"△\",IF(F116=\"600\",\"48.5\",IF(F116=\"900\",\"78.5\",IF(F116=\"1200\",\"108.5\",IF(F116=\"ウェーブS\",\"95.904\",IF(F116=\"ウェーブ\",\"123.084\",\"\"))))))","v":"△"},{"$f":"IF(F116=\"\",\"△\",((AX115^2-$F121^2)^0.5)+(7.99*2))","v":"△"},"―",{"$f":"IF(F116=\"\",\"△\",ASIN(F121/AX115))","v":"△"},null,"ｱ)ﾍﾞｰｽ間距離",{"$f":"IFERROR(IF(OR($AW$114=\"△\",$AW$116=\"△\"),((BD111^2-$F$121^2)^0.5)+(7.99*2)-(10+7.5),((BD111^2-$F$121^2)^0.5)+(7.99*2)-($AW$114+$AW$116)),\"E\")","v":"E"},{"$f":"IFERROR(IF(OR($AW$114=\"△\",$AW$116=\"△\"),((BE111^2-$F$121^2)^0.5)+(7.99*2)-(10+7.5),((BE111^2-$F$121^2)^0.5)+(7.99*2)-($AW$114+$AW$116)),\"E\")","v":"E"},{"$f":"IFERROR(IF(OR($AW$114=\"△\",$AW$116=\"△\"),((BF111^2-$F$121^2)^0.5)+(7.99*2)-(10+7.5),((BF111^2-$F$121^2)^0.5)+(7.99*2)-($AW$114+$AW$116)),\"E\")","v":"E"},{"$f":"IFERROR(IF(OR($AW$114=\"△\",$AW$116=\"△\"),((BG111^2-$F$121^2)^0.5)+(7.99*2)-(10+7.5),((BG111^2-$F$121^2)^0.5)+(7.99*2)-($AW$114+$AW$116)),\"E\")","v":"E"},{"$f":"IFERROR(IF(OR($AW$114=\"△\",$AW$116=\"△\"),((BH111^2-$F$121^2)^0.5)+(7.99*2)-(10+7.5),((BH111^2-$F$121^2)^0.5)+(7.99*2)-($AW$114+$AW$116)),\"E\")","v":"E"},"連結②",{"$f":"IFERROR(IF(BI123=\"※設置不可\",\"\",\"600\"),\"\")","v":""},{"$f":"IFERROR(IF(BL123=\"※設置不可\",\"\",\"900\"),\"\")","v":""},{"$f":"IFERROR(IF(BJ123=\"※設置不可\",\"\",\"1200\"),\"\")","v":""},{"$f":"IFERROR(IF(BK123=\"※設置不可\",\"\",\"ウェーブS\"),\"\")","v":""},{"$f":"IFERROR(IF(BM123=\"※設置不可\",\"\",\"ウェーブ\"),\"\")","v":""},{"$f":"IF(BJ115=\"\",\"\",\"☆\"&BJ115)","v":""},{"$f":"IF(BK115=\"\",\"\",\"☆\"&BK115)","v":""},{"$f":"IF(BL115=\"\",\"\",\"☆\"&BL115)","v":""},"",{"$f":"IF(BN115=\"\",\"\",\"☆\"&BN115)","v":""},null,null,"ウェ判定",{"$f":"IF(BW114<47,\"×\",IF(BW114>72,\"×\",\"〇\"))","v":{"$error":"#VALUE!"}},null,null,null,null,null,null,48.5,108.5,95.903999999999996,78.5,123.084,null,"ウ)ベ距離",null,{"$f":"IFERROR(IF(CL116-(7.5+7.5)>=$BQ$128,\"×\",CL116-(7.5+7.5)),\"E\")","v":"E"},{"$f":"IFERROR(IF(CM116-(7.5+7.5)>=$BQ$128,\"×\",CM116-(7.5+7.5)),\"E\")","v":"E"},{"$f":"IFERROR(IF(CN116-(7.5+7.5)>=$BQ$128,\"×\",CN116-(7.5+7.5)),\"E\")","v":"E"},{"$f":"IFERROR(IF(CO116-(7.5+7.5)>=$BQ$128,\"×\",CO116-(7.5+7.5)),\"E\")","v":"E"},{"$f":"IFERROR(IF(CP116-(7.5+7.5)>=$BQ$128,\"×\",CP116-(7.5+7.5)),\"E\")","v":"E"},"ウ)ベ距離",null,{"$f":"CL115","v":"E"},{"$f":"CM115","v":"E"},{"$f":"CN115","v":"E"},"E","E","ウ)ベ距離",null,{"$f":"CS115","v":"E"},{"$f":"CT115","v":"E"},{"$f":"CU115","v":"E"},{"$f":"CV115","v":"E"},{"$f":"CW115","v":"E"},"ウ)ベ距離",null,{"$f":"CZ115","v":"E"},{"$f":"DA115","v":"E"},{"$f":"DB115","v":"E"},{"$f":"DC115","v":"E"},{"$f":"DD115","v":"E"},"ウ)ベ距離",null,{"$f":"DG115","v":"E"},{"$f":"DH115","v":"E"},{"$f":"DI115","v":"E"},{"$f":"DJ115","v":"E"},{"$f":"DK115","v":"E"}]
[null,"シングル",null,null,null,null,null,null,null,{"$f":"IF(OR(B116=\"ダブル\",B116=\"ショートダブル\"),\"ショートダブル\",\"ショート\")","v":"ショート"},null,null,null,null,null,null,null,{"$f":"IF(OR(B116=\"ダブル\",B116=\"ショートダブル\"),\"ショートダブル\",\"ショート\")","v":"ショート"},null,null,null,null,null,null,null,{"$f":"IF(OR(B116=\"ダブル\",B116=\"ショートダブル\"),\"ショートダブル\",\"ショート\")","v":"ショート"},null,null,null,null,null,null,null,"シングル",null,null,null,null,{"$f":"IF(COUNTIFS(BD125:BG125,\"*×*\")>0,\"×\",\"〇\")","v":"〇"},{"$f":"IFERROR(IF(AW129=\"△\",\"△\",\"\"),\"E\")","v":"△"},{"$f":"IFERROR(IF(AZ129=\"△\",\"△\",\"\"),\"E\")","v":"△"},{"$f":"IF(OR(BX117=\"〇\",BX118=\"〇\"),\"〇\",\"×\")","v":{"$error":"#VALUE!"}},null,"ロング",{"$f":"IF(AU121=\"△\",\"\",IF(OR(B116=AR114,B116=AR116,B116=AR117),AR116,\"\"))","v":"ロング"},{"$f":"IF($AS$121=\"△\",\"\",AR116)","v":"ロング"},{"$f":"D126-(AS123-AX133)","v":{"$error":"#VALUE!"}},"リ②",7.5,"―","―",{"$f":"IF(ISBLANK(J116),\"△\",VLOOKUP(J116,固定数値!G:H,2,0))","v":28},"―",null,"連結4",{"$f":"IFERROR(IF(BD117<=$AZ$128,\"\",IF($O$121<=BD113,BD112,\"\")),\"\")","v":""},{"$f":"IFERROR(IF(BE117<=$AZ$128,\"\",IF($O$121<=BE113,BE112,\"\")),\"\")","v":""},{"$f":"IFERROR(IF(BF117<=$AZ$128,\"\",IF($O$121>=55,\"\",IF($O$121>=35,BF112,\"\"))),\"\")","v":""},{"$f":"IFERROR(IF(BG117<=$AZ$128,\"\",IF($O$121<=BG113,BG112,\"\")),\"\")","v":""},{"$f":"IFERROR(IF(BH117<=$AZ$128,\"\",IF($O$121>=72,\"\",IF($O$121>=47,BH112,\"\"))),\"\")","v":""},"連結③",{"$f":"IF(BU131=\"\",\"\",\"600\")","v":""},{"$f":"IF(BV131=\"\",\"\",\"900\")","v":""},{"$f":"IF(BW131=\"\",\"\",\"1200\")","v":""},{"$f":"IF(BX131=\"\",\"\",\"ウェーブS\")","v":""},{"$f":"IF(BY131=\"\",\"\",\"ウェーブ\")","v":""},{"$f":"IF(BJ116=\"\",\"\",\"☆\"&BJ116)","v":""},"","",{"$f":"IF(BM116=\"\",\"\",\"☆\"&BM116)","v":""},"",null,null,"最小ベ距離",{"$f":"((D128-28)/2)+(BW113-1)*D128","v":{"$error":"#VALUE!"}},null,null,null,null,"連結②シミュ",null,"600","1200","ウェーブS","900","ウェーブ",null,"ウ)支柱間",null,{"$f":"IFERROR(((BI121^2-CL$114^2)^0.5)+(7.99*2),\"E\")","v":"E"},{"$f":"IFERROR(((BJ121^2-CM$114^2)^0.5)+(7.99*2),\"E\")","v":"E"},{"$f":"IFERROR(((BK121^2-CN$114^2)^0.5)+(7.99*2),\"E\")","v":"E"},{"$f":"IFERROR(((BL121^2-CO$114^2)^0.5)+(7.99*2),\"E\")","v":"E"},{"$f":"IFERROR(((BM121^2-CP$114^2)^0.5)+(7.99*2),\"E\")","v":"E"},"ウ)支柱間",null,{"$f":"CL116","v":"E"},{"$f":"CM116","v":"E"},{"$f":"CN116","v":"E"},{"$f":"CO116","v":"E"},{"$f":"CP116","v":"E"},"ウ)支柱間",null,{"$f":"CS116","v":"E"},{"$f":"CT116","v":"E"},{"$f":"CU116","v":"E"},{"$f":"CV116","v":"E"},{"$f":"CW116","v":"E"},"ウ)支柱間",null,{"$f":"CZ116","v":"E"},{"$f":"DA116","v":"E"},{"$f":"DB116","v":"E"},{"$f":"DC116","v":"E"},{"$f":"DD116","v":"E"},"ウ)支柱間",null,{"$f":"DG116","v":"E"},{"$f":"DH116","v":"E"},{"$f":"DI116","v":"E"},{"$f":"DJ116","v":"E"},{"$f":"DK116","v":"E"}]
[null,{"$f":"IF(B116=\"\",\"手すりを選択\",IF(AS121=\"△\",\"製品を変更\",\"\"))","v":""},null,null,null,{"$f":"IF(OR(N116=\"\",V116=\"\"),\"\",IF(F116=\"\",\"連結①を選択\",IF(AND(D113=\"×\",E113=\"〇\",F119=\"×\",G119=\"〇\"),\"製品を変更\",\"\")))","v":""},null,null,null,null,null,null,null,{"$f":"IF(B113=\"\",\"\",IF(AND(N116=\"\",N119=\"〇\"),\"連結②を選択\",IF(AND(N119=\"×\",O119=\"〇\"),\"製品を変更\",\"\")))","v":""},null,null,null,null,null,null,null,{"$f":"IF(N116=\"\",\"\",IF(V116=\"\",\"連結③を選択\",IF(AND(D113=\"×\",E113=\"〇\",V119=\"×\",W119=\"〇\"),\"製品を変更\",\"\")))","v":""},null,null,null,null,null,null,null,{"$f":"IF(OR(V116=\"\",N116=\"\"),\"\",IF(AD116=\"\",\"連結④を選択\",IF(AND(D113=\"×\",E113=\"〇\",AD119=\"×\",AE119=\"〇\"),\"製品を変更\",\"\")))","v":""},null,null,null,{"$f":"IF(B116=\"\",\"\",IF(AH116=\"\",\"手すりを選択\",IF(AU121=\"△\",\"製品を変更\",IF(AND(B116=\"ダブル\",BW125=\"\"),\"両手すりに変更\",IF(AND(BP125=\"S\",AH116=\"ショートダブル\"),\"片手すり(大ベース)に変更\",IF(AND(BS125=\"\",BW125=\"D\"),\"片手すりに変更\",IF(AND(BP125=\"S\",BQ125=\"S\"),\"大ベース製品に変更\",IF(AND(B116=\"ショートダブル\",BW125=\"\"),\"ダブルに変更\",\"\"))))))))","v":""},null,null,null,{"$f":"IF(AZ114=\"△\",\"△\",IF(Y120=\"×\",\"×\",IF(AZ114<=Y120,\"〇\",\"×\")))","v":"〇"},{"$f":"IF(AZ122=\"△\",\"△\",IF(AND(C113=\"×\",E113=\"〇\"),\"△\",IF(AK120=\"×\",\"×\",IF(AZ122<=AK120,\"〇\",\"×\"))))","v":"〇"},{"$f":"IF(COUNTIFS(BD126:BG126,\"*×*\")>0,\"×\",\"〇\")","v":"〇"},{"$f":"IFERROR(IF(AZ128<=AZ129,\"〇\",\"×\"),\"E\")","v":"〇"},{"$f":"IFERROR(IF(AW128<=AW129,\"〇\",\"×\"),\"E\")","v":"〇"},null,"ショート",{"$f":"IF(OR(B116=AR114,B116=AR116),AR117,\"\")","v":"ショート"},{"$f":"AR117","v":"ショート"},null,"連②","―",{"$f":"IF(ISBLANK(N116),\"△\",IF(N116=\"600\",\"48.5\",IF(N116=\"900\",\"78.5\",IF(N116=\"1200\",\"108.5\",IF(N116=\"ウェーブS\",\"95.904\",IF(N116=\"ウェーブ\",\"123.084\",\"\"))))))","v":"△"},{"$f":"IF(I121=\"\",\"△\",((AX117^2-$I121^2)^0.5)+(7.99*2))","v":"△"},"―",{"$f":"IF(I121=\"\",\"△\",ASIN(I121/AX117))","v":"△"},null,"ｳ)ﾍﾞｰｽ間距離",{"$f":"IFERROR(IF(OR($AW$120=\"△\",$AW$122=\"△\"),((BD111^2-$O$121^2)^0.5)+(7.99*2)-(10+7.5),((BD111^2-$O$121^2)^0.5)+(7.99*2)-($AW$120+$AW$122)),\"E\")","v":"E"},{"$f":"IFERROR(IF(OR($AW$120=\"△\",$AW$122=\"△\"),((BE111^2-$O$121^2)^0.5)+(7.99*2)-(10+7.5),((BE111^2-$O$121^2)^0.5)+(7.99*2)-($AW$120+$AW$122)),\"E\")","v":"E"},{"$f":"IFERROR(IF(OR($AW$120=\"△\",$AW$122=\"△\"),((BF111^2-$O$121^2)^0.5)+(7.99*2)-(10+7.5),((BF111^2-$O$121^2)^0.5)+(7.99*2)-($AW$120+$AW$122)),\"E\")","v":"E"},{"$f":"IFERROR(IF(OR($AW$120=\"△\",$AW$122=\"△\"),((BG111^2-$O$121^2)^0.5)+(7.99*2)-(10+7.5),((BG111^2-$O$121^2)^0.5)+(7.99*2)-($AW$120+$AW$122)),\"E\")","v":"E"},{"$f":"IFERROR(IF(OR($AW$120=\"△\",$AW$122=\"△\"),((BH111^2-$O$121^2)^0.5)+(7.99*2)-(10+7.5),((BH111^2-$O$121^2)^0.5)+(7.99*2)-($AW$120+$AW$122)),\"E\")","v":"E"},"連結④",{"$f":"IF(BD116=\"\",\"\",\"600\")","v":""},{"$f":"IF(BE116=\"\",\"\",\"900\")","v":""},{"$f":"IF(BG116=\"\",\"\",\"1200\")","v":""},{"$f":"IF(BF116=\"\",\"\",\"ウェーブS\")","v":""},{"$f":"IF(BH116=\"\",\"\",\"ウェーブ\")","v":""},null,null,null,null,null,null,null,"1200ベ距離",{"$f":"(((108.5^2-$BW$114^2)^0.5)+(7.99*2))-(10+7.5)","v":{"$error":"#VALUE!"}},{"$f":"IF(BW117-BW116>0,\"〇\",\"×\")","v":{"$error":"#VALUE!"}},null,null,null,"イ)ベ距離",null,{"$f":"IFERROR(CD121-(7.5+7.5),\"E\")","v":"E"},{"$f":"IFERROR(CE121-(7.5+7.5),\"E\")","v":"E"},"E","E","E",null,"連結③シミュ",null,{"$f":"IFERROR(IF(CL127=\"×\",\"\",IF(CL115<CD126,\"\",IF(CL115>CD127,\"\",\"〇\"))),\"\")","v":""},{"$f":"IFERROR(IF(CM127=\"×\",\"\",IF(CM115<CD126,\"\",IF(CM115>CD127,\"\",\"〇\"))),\"\")","v":""},{"$f":"IFERROR(IF(CN127=\"×\",\"\",IF(CN115<CD126,\"\",IF(CN115>CD127,\"\",\"〇\"))),\"\")","v":""},{"$f":"IFERROR(IF(CO127=\"×\",\"\",IF(CO115<CD126,\"\",IF(CO115>CD127,\"\",\"〇\"))),\"\")","v":""},{"$f":"IFERROR(IF(CP127=\"×\",\"\",IF(CP115<CD126,\"\",IF(CP115>CD127,\"\",\"〇\"))),\"\")","v":""},"連結③シミュ",null,{"$f":"IFERROR(IF(CS127=\"×\",\"\",IF(CS115<$CE$126,\"\",IF(CS115>$CE$127,\"\",\"〇\"))),\"\")","v":""},{"$f":"IFERROR(IF(CT127=\"×\",\"\",IF(CT115<$CE$126,\"\",IF(CT115>$CE$127,\"\",\"〇\"))),\"\")","v":""},{"$f":"IFERROR(IF(CU127=\"×\",\"\",IF(CU115<$CE$126,\"\",IF(CU115>$CE$127,\"\",\"〇\"))),\"\")","v":""},{"$f":"IFERROR(IF(CV127=\"×\",\"\",IF(CV115<$CE$126,\"\",IF(CV115>$CE$127,\"\",\"〇\"))),\"\")","v":""},{"$f":"IFERROR(IF(CW127=\"×\",\"\",IF(CW115<$CE$126,\"\",IF(CW115>$CE$127,\"\",\"〇\"))),\"\")","v":""},"連結③シミュ",null,{"$f":"IFERROR(IF(CZ127=\"×\",\"\",IF(CZ115<$CF$126,\"\",IF(CZ115>$CF$127,\"\",\"〇\"))),\"\")","v":""},{"$f":"IFERROR(IF(DA127=\"×\",\"\",IF(DA115<$CF$126,\"\",IF(DA115>$CF$127,\"\",\"〇\"))),\"\")","v":""},{"$f":"IFERROR(IF(DB127=\"×\",\"\",IF(DB115<$CF$126,\"\",IF(DB115>$CF$127,\"\",\"〇\"))),\"\")","v":""},{"$f":"IFERROR(IF(DC127=\"×\",\"\",IF(DC115<$CF$126,\"\",IF(DC115>$CF$127,\"\",\"〇\"))),\"\")","v":""},{"$f":"IFERROR(IF(DD127=\"×\",\"\",IF(DD115<$CF$126,\"\",IF(DD115>$CF$127,\"\",\"〇\"))),\"\")","v":""},"連結③シミュ",null,{"$f":"IFERROR(IF(DG127=\"×\",\"\",IF(DG115<$CG$126,\"\",IF(DG115>$CG$127,\"\",\"〇\"))),\"\")","v":""},{"$f":"IFERROR(IF(DH127=\"×\",\"\",IF(DH115<$CG$126,\"\",IF(DH115>$CG$127,\"\",\"〇\"))),\"\")","v":""},{"$f":"IFERROR(IF(DI127=\"×\",\"\",IF(DI115<$CG$126,\"\",IF(DI115>$CG$127,\"\",\"〇\"))),\"\")","v":""},{"$f":"IFERROR(IF(DJ127=\"×\",\"\",IF(DJ115<$CG$126,\"\",IF(DJ115>$CG$127,\"\",\"〇\"))),\"\")","v":""},{"$f":"IFERROR(IF(DK127=\"×\",\"\",IF(DK115<$CG$126,\"\",IF(DK115>$CG$127,\"\",\"〇\"))),\"\")","v":""},"連結③シミュ",null,{"$f":"IFERROR(IF(DN127=\"×\",\"\",IF(DN115<$CH$126,\"\",IF(DN115>$CH$127,\"\",\"〇\"))),\"\")","v":""},{"$f":"IFERROR(IF(DO127=\"×\",\"\",IF(DO115<$CH$126,\"\",IF(DO115>$CH$127,\"\",\"〇\"))),\"\")","v":""},{"$f":"IFERROR(IF(DP127=\"×\",\"\",IF(DP115<$CH$126,\"\",IF(DP115>$CH$127,\"\",\"〇\"))),\"\")","v":""},{"$f":"IFERROR(IF(DQ127=\"×\",\"\",IF(DQ115<$CH$126,\"\",IF(DQ115>$CH$127,\"\",\"〇\"))),\"\")","v":""},{"$f":"IFERROR(IF(DR127=\"×\",\"\",IF(DR115<$CH$126,\"\",IF(DR115>$CH$127,\"\",\"〇\"))),\"\")","v":""}]
[null,null,null,null,null,{"$f":"IF(AND(N119=\"〇\",V116=\"\"),\"\",IF(AND(BD114=\"\",BE114=\"\",BF114=\"\",BG114=\"\",BH114=\"\"),\"ナシ\",IF(COUNTIFS(AL115:AO116,\"×\")>0,\"ナシ\",BD114&BE114&BG114&BF114&BH114)))","v":""},null,null,null,null,null,null,null,{"$f":"IF(B113=\"\",\"\",IF(AND(BO115=\"\",BP115=\"\",BQ115=\"\",BR115=\"\",BS115=\"\"),\"ナシ\",IF(COUNTIFS(AL115:AO116,\"×\")>0,\"ナシ\",BO115&BP115&BQ115&BR115&BS115)))","v":""},null,null,null,null,null,null,null,{"$f":"IF(AND(N119=\"〇\",N116=\"\"),\"\",IF(AND(BO116=\"\",BP116=\"\",BQ116=\"\",BR116=\"\",BS116=\"\"),\"ナシ\",IF(COUNTIFS(AL115:AO116,\"×\")>0,\"ナシ\",BO116&BP116&BQ116&BR116&BS116)))","v":""},null,null,null,null,null,null,null,{"$f":"IF(AND(V119=\"〇\",V116=\"\"),\"\",IF(AND(BD116=\"\",BE116=\"\",BF116=\"\",BG116=\"\",BH116=\"\"),\"ナシ\",IF(COUNTIFS(AL115:AO116,\"×\")>0,\"ナシ\",BD116&BE116&BG116&BF116&BH116)))","v":""},null,null,null,null,null,null,null,null,{"$f":"IF(COUNTIFS(AW133:AZ133,\"*×*\")>0,\"×\",\"〇\")","v":"〇"},null,null,null,null,"ショートダブル",{"$f":"IF(B116=AR115,AR118,\"\")","v":""},{"$f":"AR118","v":"ショートダブル"},{"$f":"IF((D126-1)/3<=0,\"×\",ROUNDDOWN(D126/2,0))","v":"×"},"リ③",7.5,"―","―",{"$f":"IF(ISBLANK(R116),\"△\",VLOOKUP(R116,固定数値!G:H,2,0))","v":28},"―",null,null,null,null,null,null,null,{"$f":"IFERROR(IF(OR(CX99=\"\",CZ99=\"\",DB99=\"\",DD99=\"\",DF99=\"\"),\"\",\"E\"),\"E\")","v":"E"},{"$f":"IFERROR(IF(OR(CX100=\"\",CZ100=\"\",DB100=\"\",DD100=\"\",DF100=\"\"),\"\",\"E\"),\"E\")","v":"E"},{"$f":"IFERROR(IF(OR(CX101=\"\",CZ101=\"\",DB101=\"\",DD101=\"\",DF101=\"\"),\"\",\"E\"),\"E\")","v":"E"},{"$f":"IFERROR(IF(OR(CX102=\"\",CZ102=\"\",DB102=\"\",DD102=\"\",DF102=\"\"),\"\",\"E\"),\"E\")","v":"E"},{"$f":"IFERROR(IF(OR(CX103=\"\",CZ103=\"\",DB103=\"\",DD103=\"\",DF103=\"\"),\"\",\"E\"),\"E\")","v":"E"},null,null,600,1200,"ウェーブS",900,"ウェーブ",null,"ウェベ距離",{"$f":"(((123.1^2-$BW$114^2)^0.5)+(7.99*2))-(10+7.5)","v":{"$error":"#VALUE!"}},{"$f":"IF(BW115=\"×\",\"×\",IF(BW118-BW116>0,\"〇\",\"×\"))","v":{"$error":"#VALUE!"}},"最小F値",null,{"$f":"MIN(CD118:CH118)","v":0},"イ)F位置",null,{"$f":"IFERROR(IF(CD122/2<0,\"E\",CD122/2),\"E\")","v":"E"},{"$f":"IFERROR(IF(CE122/2<0,\"E\",CE122/2),\"E\")","v":"E"},{"$f":"IFERROR(IF(CF122/2<0,\"E\",CF122/2),\"E\")","v":"E"},"E","E",null,null,"③",{"$f":"CD128","v":"E"},{"$f":"CE128","v":"E"},"E","E","E",null,"③",{"$f":"CL118","v":"E"},{"$f":"CM118","v":"E"},"E","E","E",null,"③",{"$f":"CS118","v":"E"},{"$f":"CT118","v":"E"},{"$f":"CU118","v":"E"},{"$f":"CV118","v":"E"},{"$f":"CW118","v":"E"},null,"③",{"$f":"CZ118","v":"E"},{"$f":"DA118","v":"E"},{"$f":"DB118","v":"E"},{"$f":"DC118","v":"E"},{"$f":"DD118","v":"E"},null,"③",{"$f":"DG118","v":"E"},{"$f":"DH118","v":"E"},{"$f":"DI118","v":"E"},{"$f":"DJ118","v":"E"},{"$f":"DK118","v":"E"}]
[null,{"$f":"IF(OR(B117=\"\",B117=\"手すりを選択\"),\"〇\",\"×\")","v":"〇"},null,null,null,{"$f":"IF(OR(F116=\"\",N116=\"\",V116=\"\"),\"〇\",IF(COUNTIF(BJ114:BN114,F116)=0,\"×\",\"〇\"))","v":"〇"},{"$f":"IF(O119=\"〇\",\"〇\",IF(F118=\"ナシ\",\"×\",\"〇\"))","v":"〇"},null,null,null,null,null,null,{"$f":"IF(N116=\"\",\"〇\",IF(COUNTIF(BJ115:BN115,N116)=0,\"×\",\"〇\"))","v":"〇"},{"$f":"IF(N118=\"ナシ\",\"×\",\"〇\")","v":"〇"},{"$f":"IF(AND(N119=\"×\",O119=\"〇\"),\"△\",\"\")","v":""},null,null,null,null,null,{"$f":"IF(OR(N116=\"\",V116=\"\"),\"〇\",IF(COUNTIF(BJ116:BN116,V116)=0,\"×\",\"〇\"))","v":"〇"},{"$f":"IF(V118=\"ナシ\",\"×\",\"〇\")","v":"〇"},{"$f":"IF(AND(V119=\"×\",W119=\"〇\"),\"△\",\"\")","v":""},null,null,null,null,null,{"$f":"IF(OR(N116=\"\",V116=\"\",AD116=\"\"),\"〇\",IF(COUNTIF(BJ117:BN117,AD116)=0,\"×\",\"〇\"))","v":"〇"},{"$f":"IF(O119=\"〇\",\"〇\",IF(AD118=\"ナシ\",\"×\",\"〇\"))","v":"〇"},null,null,{"$f":"IF(OR(AH117=\"\",AH117=\"手すりを選択\"),\"〇\",\"×\")","v":"〇"},null,null,null,null,null,null,null,null,null,null,null,null,null,"連③","―",{"$f":"IF(ISBLANK(V116),\"△\",IF(V116=\"600\",\"48.5\",IF(V116=\"900\",\"78.5\",IF(V116=\"1200\",\"108.5\",IF(V116=\"ウェーブS\",\"95.904\",IF(V116=\"ウェーブ\",\"123.084\",\"\"))))))","v":"△"},{"$f":"IF(L121=\"\",\"△\",((AX119^2-$L121^2)^0.5)+(7.99*2))","v":"△"},"―",{"$f":"IF(L121=\"\",\"△\",ASIN(L121/AX119))","v":"△"},null,null,null,null,null,null,null,{"$f":"IF(COUNTIFS(CL117:CP117,\"〇\")>0,\"\",\"E\")","v":"E"},{"$f":"IF(COUNTIFS(CS117:CW117,\"〇\")>0,\"\",\"E\")","v":"E"},{"$f":"IF(COUNTIFS(CZ117:DD117,\"〇\")>0,\"\",\"E\")","v":"E"},{"$f":"IF(COUNTIFS(DG117:DK117,\"〇\")>0,\"\",\"E\")","v":"E"},{"$f":"IF(COUNTIFS(DN117:DR117,\"〇\")>0,\"\",\"E\")","v":"E"},null,"ア段数",{"$f":"IFERROR(IF(ROUNDDOWN(($F$23-(BP120+$BQ$130))/2,0)<=0,\"×\",$AS$123-BP120),\"\")","v":""},{"$f":"IFERROR(IF(ROUNDDOWN(($F$23-(BQ120+$BQ$130))/2,0)<=0,\"×\",$AS$123-BQ120),\"\")","v":""},{"$f":"IFERROR(IF(ROUNDDOWN(($F$23-(BR120+$BQ$130))/2,0)<=0,\"×\",$AS$123-BR120),\"\")","v":""},{"$f":"IFERROR(IF(ROUNDDOWN(($F$23-(BS120+$BQ$130))/2,0)<=0,\"×\",$AS$123-BS120),\"\")","v":""},{"$f":"IFERROR(IF(ROUNDDOWN(($F$23-(BT120+$BQ$130))/2,0)<=0,\"×\",$AS$123-BT120),\"\")","v":""},null,null,null,null,null,null,null,"イ)段数",null,{"$f":"IFERROR(BI122+1,\"×\")","v":"×"},{"$f":"IFERROR(BJ122+1,\"×\")","v":"×"},{"$f":"IFERROR(BK122+1,\"×\")","v":"×"},{"$f":"IFERROR(BL122+1,\"×\")","v":"×"},{"$f":"IFERROR(BM122+1,\"×\")","v":"×"},null,null,"⑪","E","E","E","E","E",null,"⑪",{"$f":"CL119","v":"E"},"E","E","E","E",null,"⑪",{"$f":"CS119","v":"E"},"E","E","E","E",null,"⑪",{"$f":"CZ119","v":"E"},"E","E","E","E",null,"⑪",{"$f":"DG119","v":"E"},"E","E","E","E"]
[null,null,null,null,null,"ア",null,null,"イ",null,null,"ウ",null,null,"エ",null,null,null,"上段 必要スペース",null,null,null,null,null,{"$f":"IFERROR(IF(AS121=\"×\",\"×\",IF(BR126>=0,ROUNDUP(BM132,0),IF(OR(BF129=\"E\",BH129=\"E\"),ROUNDUP(BM132,0),IF(BR126<0,ROUNDUP(BF129,0),ROUNDUP(BM132,0))))),\"\")","v":""},null,"cm以上",null,null,null,"下段 必要スペース",null,null,null,null,null,{"$f":"IFERROR(IF(BR126>=0,ROUNDUP(BN132,0),IF(OR(BH129=\"E\",BF129=\"E\"),ROUNDUP(BN132,0),IF(BR126<0,ROUNDUP(BH129,0),IF(BN132>=AZ122,ROUNDUP(BN132,0),\"×\")))),\"\")","v":""},null,"cm以上",null,null,null,null,"上段必スぺ",{"$f":"IF(BR126<0,BF129-AZ114,BM132-AZ114)","v":{"$error":"#VALUE!"}},"下段必スぺ",{"$f":"IF(BR126<0,BH129-AZ122,BN132-AZ122)","v":{"$error":"#VALUE!"}},"リ④",7.5,"―","―",{"$f":"IF(ISBLANK(Z116),\"△\",VLOOKUP(Z116,固定数値!G:H,2,0))","v":28},"―",null,null,"ア","イ","ウ","エ",null,"600","1200","ウェーブS","900","ウェーブ",null,"イ段数",{"$f":"IFERROR(BI122+1,\"\")","v":""},{"$f":"IFERROR(BJ122+1,\"\")","v":""},{"$f":"IFERROR(BK122+1,\"\")","v":""},{"$f":"IFERROR(BL122+1,\"\")","v":""},{"$f":"IFERROR(BM122+1,\"\")","v":""},null,null,null,null,null,null,null,"イ)段差",null,{"$f":"IFERROR(CD119*$D$127,\"E\")","v":"E"},{"$f":"IFERROR(CE119*$D$127,\"E\")","v":"E"},{"$f":"IFERROR(CF119*$D$127,\"E\")","v":"E"},{"$f":"IFERROR(CG119*$D$127,\"E\")","v":"E"},{"$f":"IFERROR(CH119*$D$127,\"E\")","v":"E"},null,null,"⑫",{"$f":"IFERROR(($CD$117+CL115+28)-(($CD$119+CL113-1)*$D$128),\"E\")","v":"E"},{"$f":"IFERROR(($CD$117+CM115+28)-(($CD$119+CM113-1)*$D$128),\"E\")","v":"E"},{"$f":"IFERROR(($CD$117+CN115+28)-(($CD$119+CN113-1)*$D$128),\"E\")","v":"E"},{"$f":"IFERROR(($CD$117+CO115+28)-(($CD$119+CO113-1)*$D$128),\"E\")","v":"E"},{"$f":"IFERROR(($CD$117+CP115+28)-(($CD$119+CP113-1)*$D$128),\"E\")","v":"E"},null,"⑫",{"$f":"IFERROR(($CE$117+CS115+28)-(($CE$119+CS113-1)*$D$128),\"E\")","v":"E"},{"$f":"IFERROR(($CE$117+CT115+28)-(($CE$119+CT113-1)*$D$128),\"E\")","v":"E"},{"$f":"IFERROR(($CE$117+CU115+28)-(($CE$119+CU113-1)*$D$128),\"E\")","v":"E"},{"$f":"IFERROR(($CE$117+CV115+28)-(($CE$119+CV113-1)*$D$128),\"E\")","v":"E"},{"$f":"IFERROR(($CE$117+CW115+28)-(($CE$119+CW113-1)*$D$128),\"E\")","v":"E"},null,"⑫",{"$f":"IFERROR(($CF$117+CZ115+28)-(($CF$119+CZ113-1)*$D$128),\"E\")","v":"E"},{"$f":"IFERROR(($CF$117+DA115+28)-(($CF$119+DA113-1)*$D$128),\"E\")","v":"E"},{"$f":"IFERROR(($CF$117+DB115+28)-(($CF$119+DB113-1)*$D$128),\"E\")","v":"E"},{"$f":"IFERROR(($CF$117+DC115+28)-(($CF$119+DC113-1)*$D$128),\"E\")","v":"E"},{"$f":"IFERROR(($CF$117+DD115+28)-(($CF$119+DD113-1)*$D$128),\"E\")","v":"E"},null,"⑫",{"$f":"IFERROR(($CG$117+DG115+28)-(($CG$119+DG113-1)*$D$128),\"E\")","v":"E"},{"$f":"IFERROR(($CG$117+DH115+28)-(($CG$119+DH113-1)*$D$128),\"E\")","v":"E"},{"$f":"IFERROR(($CG$117+DI115+28)-(($CG$119+DI113-1)*$D$128),\"E\")","v":"E"},{"$f":"IFERROR(($CG$117+DJ115+28)-(($CG$119+DJ113-1)*$D$128),\"E\")","v":"E"},{"$f":"IFERROR(($CG$117+DK115+28)-(($CG$119+DK113-1)*$D$128),\"E\")","v":"E"},null,"⑫",{"$f":"IFERROR(($CH$117+DN115+28)-(($CH$119+DN113-1)*$D$128),\"E\")","v":"E"},{"$f":"IFERROR(($CH$117+DO115+28)-(($CH$119+DO113-1)*$D$128),\"E\")","v":"E"},{"$f":"IFERROR(($CH$117+DP115+28)-(($CH$119+DP113-1)*$D$128),\"E\")","v":"E"},{"$f":"IFERROR(($CH$117+DQ115+28)-(($CH$119+DQ113-1)*$D$128),\"E\")","v":"E"},{"$f":"IFERROR(($CH$117+DR115+28)-(($CH$119+DR113-1)*$D$128),\"E\")","v":"E"}]
[null,"段　差",null,null,null,{"$f":"IFERROR((AW126*$F$26),\"\")","v":""},null,"cm",{"$f":"IFERROR(IF(AV126>0,\"\",AX133*$F$26),\"\")","v":""},null,"cm",{"$f":"IFERROR(IF(AV126>0,\"\",AY133*$F$26),\"\")","v":""},null,"cm",{"$f":"IFERROR(AZ126*$F$26,\"\")","v":""},null,"cm",null,null,null,null,null,null,null,null,null,null,null,null,null,null,null,null,null,null,null,null,null,null,null,null,null,null,null,{"$f":"IFERROR(IF(AS120<-2.5,\"×\",IF(AS120>=0,\"〇\",\"△\")),\"\")","v":""},null,{"$f":"IFERROR(IF(AU120<-2.5,\"×\",IF(AU120>=0,\"〇\",\"△\")),\"\")","v":""},"連④","―",{"$f":"IF(ISBLANK(AD116),\"△\",IF(AD116=\"600\",\"48.5\",IF(AD116=\"900\",\"78.5\",IF(AD116=\"1200\",\"108.5\",IF(AD116=\"ウェーブS\",\"95.904\",IF(AD116=\"ウェーブ\",\"123.084\",\"\"))))))","v":"△"},{"$f":"IF(AD116=\"\",\"△\",((AX121^2-$O121^2)^0.5)+(7.99*2))","v":"△"},"―",{"$f":"IF(AD116=\"\",\"△\",ASIN(O121/AX121))","v":"△"},null,"角度チェック",{"$f":"IF(F123=\"\",\"△\",COUNTIFS(F123,\">=\"&-7.014,F123,\"<=\"&7.014))","v":"△"},{"$f":"IF(I123=\"\",\"△\",COUNTIFS(I123,\">=\"&-7.014,I123,\"<=\"&7.014))","v":"△"},{"$f":"IF(L123=\"\",\"△\",COUNTIFS(L123,\">=\"&-7.014,L123,\"<=\"&7.014))","v":"△"},{"$f":"IF(O123=\"\",\"△\",COUNTIFS(O123,\">=\"&-7.014,O123,\"<=\"&7.014))","v":"△"},null,48.5,108.5,95.9,78.5,123.1,null,"段差",{"$f":"IFERROR(BP119*$D$127,\"\")","v":""},{"$f":"IFERROR(BQ119*$D$127,\"\")","v":""},{"$f":"IFERROR(BR119*$D$127,\"\")","v":""},{"$f":"IFERROR(BS119*$D$127,\"\")","v":""},{"$f":"IFERROR(BT119*$D$127,\"\")","v":""},null,null,null,null,null,null,null,"イ)支柱間",null,{"$f":"IFERROR(((BI121^2-CD$120^2)^0.5)+(7.99*2),\"E\")","v":"E"},{"$f":"IFERROR(((BJ121^2-CE$120^2)^0.5)+(7.99*2),\"E\")","v":"E"},{"$f":"IFERROR(((BK121^2-CF$120^2)^0.5)+(7.99*2),\"E\")","v":"E"},{"$f":"IFERROR(((BL121^2-CG$120^2)^0.5)+(7.99*2),\"E\")","v":"E"},{"$f":"IFERROR(((BM121^2-CH$120^2)^0.5)+(7.99*2),\"E\")","v":"E"},null,null,"⑬",{"$f":"IFERROR((($CD$119+CL113+1)*$D$128)-($CD$117+CL115+28+56),\"E\")","v":"E"},{"$f":"IFERROR((($CD$119+CM113+1)*$D$128)-($CD$117+CM115+28+56),\"E\")","v":"E"},{"$f":"IFERROR((($CD$119+CN113+1)*$D$128)-($CD$117+CN115+28+56),\"E\")","v":"E"},{"$f":"IFERROR((($CD$119+CO113+1)*$D$128)-($CD$117+CO115+28+56),\"E\")","v":"E"},{"$f":"IFERROR((($CD$119+CP113+1)*$D$128)-($CD$117+CP115+28+56),\"E\")","v":"E"},null,"⑬",{"$f":"IFERROR((($CE$119+CS113+1)*$D$128)-($CE$117+CS115+28+56),\"E\")","v":"E"},{"$f":"IFERROR((($CE$119+CT113+1)*$D$128)-($CE$117+CT115+28+56),\"E\")","v":"E"},{"$f":"IFERROR((($CE$119+CU113+1)*$D$128)-($CE$117+CU115+28+56),\"E\")","v":"E"},{"$f":"IFERROR((($CE$119+CV113+1)*$D$128)-($CE$117+CV115+28+56),\"E\")","v":"E"},{"$f":"IFERROR((($CE$119+CW113+1)*$D$128)-($CE$117+CW115+28+56),\"E\")","v":"E"},null,"⑬",{"$f":"IFERROR((($CF$119+CZ113+1)*$D$128)-($CF$117+CZ115+28+56),\"E\")","v":"E"},{"$f":"IFERROR((($CF$119+DA113+1)*$D$128)-($CF$117+DA115+28+56),\"E\")","v":"E"},{"$f":"IFERROR((($CF$119+DB113+1)*$D$128)-($CF$117+DB115+28+56),\"E\")","v":"E"},{"$f":"IFERROR((($CF$119+DC113+1)*$D$128)-($CF$117+DC115+28+56),\"E\")","v":"E"},{"$f":"IFERROR((($CF$119+DD113+1)*$D$128)-($CF$117+DD115+28+56),\"E\")","v":"E"},null,"⑬",{"$f":"IFERROR((($CG$119+DG113+1)*$D$128)-($CG$117+DG115+28+56),\"E\")","v":"E"},{"$f":"IFERROR((($CG$119+DH113+1)*$D$128)-($CG$117+DH115+28+56),\"E\")","v":"E"},{"$f":"IFERROR((($CG$119+DI113+1)*$D$128)-($CG$117+DI115+28+56),\"E\")","v":"E"},{"$f":"IFERROR((($CG$119+DJ113+1)*$D$128)-($CG$117+DJ115+28+56),\"E\")","v":"E"},{"$f":"IFERROR((($CG$119+DK113+1)*$D$128)-($CG$117+DK115+28+56),\"E\")","v":"E"},null,"⑬",{"$f":"IFERROR((($CH$119+DN113+1)*$D$128)-($CH$117+DN115+28+56),\"E\")","v":"E"},{"$f":"IFERROR((($CH$119+DO113+1)*$D$128)-($CH$117+DO115+28+56),\"E\")","v":"E"},{"$f":"IFERROR((($CH$119+DP113+1)*$D$128)-($CH$117+DP115+28+56),\"E\")","v":"E"},{"$f":"IFERROR((($CH$119+DQ113+1)*$D$128)-($CH$117+DQ115+28+56),\"E\")","v":"E"},{"$f":"IFERROR((($CH$119+DR113+1)*$D$128)-($CH$117+DR115+28+56),\"E\")","v":"E"}]
[null,"連結バー角度",null,null,null,{"$f":"IFERROR(BA115*180/PI(),\"\")","v":""},null,"°",{"$f":"IFERROR(BA117*180/PI(),\"\")","v":""},null,"°",{"$f":"IFERROR(BA119*180/PI(),\"\")","v":""},null,"°",{"$f":"IFERROR(BA121*180/PI(),\"\")","v":""},null,"°",null,null,null,null,{"$f":"IF(F116=\"\",\"未選択\",F116)","v":"未選択"},null,null,null,null,null,null,null,null,null,null,null,null,null,null,null,null,null,null,null,null,null,"真ん中段数",{"$f":"IF((D126-1)/3<=0,\"×\",ROUNDDOWN(D126/2,0))","v":"×"},"段",null,"リ⑤",{"$f":"IF(ISBLANK(AH116),\"△\",VLOOKUP(AH116,固定数値!E:F,2,0))","v":10},"―","―",{"$f":"IF(ISBLANK(AH116),\"△\",VLOOKUP(AH116,固定数値!G:H,2,0))","v":49.5},"―",null,"(F)40°以上×",{"$f":"IF(F122=\"\",\"△\",IF(F122<=40.2,\"〇\",\"×\"))","v":"△"},{"$f":"IF(I122=\"\",\"△\",IF(I122<=40.2,\"〇\",\"×\"))","v":"△"},{"$f":"IF(L122=\"\",\"△\",IF(L122<=40.2,\"〇\",\"×\"))","v":"△"},{"$f":"IF(O122=\"\",\"△\",IF(O122<=40.2,\"〇\",\"×\"))","v":"△"},null,{"$f":"INDEX('S+Sﾁｪｯｸ表'!$D$6:$AG$28, MATCH($F$29,'S+Sﾁｪｯｸ表'!$C$6:$C$28,0), MATCH($F$26,'S+Sﾁｪｯｸ表'!$D$5:$AG$5,0))","v":{"$error":"#N/A"}},{"$f":"INDEX('S+Sﾁｪｯｸ表'!$D$60:$AG$82, MATCH($F$29,'S+Sﾁｪｯｸ表'!$C$60:$C$82,0), MATCH($F$26,'S+Sﾁｪｯｸ表'!$D$59:$AG$59,0))","v":{"$error":"#N/A"}},{"$f":"INDEX('S+Sﾁｪｯｸ表'!$D$87:$AG$109, MATCH($F$29,'S+Sﾁｪｯｸ表'!$C$87:$C$109,0), MATCH($F$26,'S+Sﾁｪｯｸ表'!$D$86:$AG$86,0))","v":{"$error":"#N/A"}},{"$f":"INDEX('S+Sﾁｪｯｸ表'!$D$33:$AG$55, MATCH($F$29,'S+Sﾁｪｯｸ表'!$C$33:$C$55,0), MATCH($F$26,'S+Sﾁｪｯｸ表'!$D$32:$AG$32,0))","v":{"$error":"#N/A"}},{"$f":"INDEX('S+Sﾁｪｯｸ表'!$D$114:$AG$136, MATCH($F$29,'S+Sﾁｪｯｸ表'!$C$114:$C$136,0), MATCH($F$26,'S+Sﾁｪｯｸ表'!$D$113:$AG$113,0))","v":{"$error":"#N/A"}},"連結②",null,null,null,null,null,null,null,null,null,null,null,null,null,"仮最小振り幅",null,{"$f":"IF(AND(CL124=\"E\",CM124=\"E\",CN124=\"E\",CO124=\"E\",CP124=\"E\"),\"E\",MIN(CL124:CP124))","v":"E"},{"$f":"IF(AND(CS124=\"E\",CT124=\"E\",CU124=\"E\",CV124=\"E\",CW124=\"E\"),\"E\",MIN(CS124:CW124))","v":"E"},{"$f":"IF(AND(CZ124=\"E\",DA124=\"E\",DB124=\"E\",DC124=\"E\",DD124=\"E\"),\"E\",MIN(CZ124:DD124))","v":"E"},{"$f":"IF(AND(DG124=\"E\",DH124=\"E\",DI124=\"E\",DJ124=\"E\",DK124=\"E\"),\"E\",MIN(DG124:DK124))","v":"E"},{"$f":"IF(AND(DN124=\"E\",DO124=\"E\",DP124=\"E\",DQ124=\"E\",DR124=\"E\"),\"E\",MIN(DN124:DR124))","v":"E"},null,null,"⑩",{"$f":"IFERROR(((CL113+1)*$D$128)-(CL115+56),\"E\")","v":"E"},{"$f":"IFERROR(((CM113+1)*$D$128)-(CM115+56),\"E\")","v":"E"},{"$f":"IFERROR(((CN113+1)*$D$128)-(CN115+56),\"E\")","v":"E"},{"$f":"IFERROR(((CO113+1)*$D$128)-(CO115+56),\"E\")","v":"E"},{"$f":"IFERROR(((CP113+1)*$D$128)-(CP115+56),\"E\")","v":"E"},null,"⑩",{"$f":"IFERROR(((CS113+1)*$D$128)-(CS115+56),\"E\")","v":"E"},{"$f":"IFERROR(((CT113+1)*$D$128)-(CT115+56),\"E\")","v":"E"},{"$f":"IFERROR(((CU113+1)*$D$128)-(CU115+56),\"E\")","v":"E"},{"$f":"IFERROR(((CV113+1)*$D$128)-(CV115+56),\"E\")","v":"E"},{"$f":"IFERROR(((CW113+1)*$D$128)-(CW115+56),\"E\")","v":"E"},null,"⑩",{"$f":"IFERROR(((CZ113+1)*$D$128)-(CZ115+56),\"E\")","v":"E"},{"$f":"IFERROR(((DA113+1)*$D$128)-(DA115+56),\"E\")","v":"E"},{"$f":"IFERROR(((DB113+1)*$D$128)-(DB115+56),\"E\")","v":"E"},{"$f":"IFERROR(((DC113+1)*$D$128)-(DC115+56),\"E\")","v":"E"},{"$f":"IFERROR(((DD113+1)*$D$128)-(DD115+56),\"E\")","v":"E"},null,"⑩",{"$f":"IFERROR(((DG113+1)*$D$128)-(DG115+56),\"E\")","v":"E"},{"$f":"IFERROR(((DH113+1)*$D$128)-(DH115+56),\"E\")","v":"E"},{"$f":"IFERROR(((DI113+1)*$D$128)-(DI115+56),\"E\")","v":"E"},{"$f":"IFERROR(((DJ113+1)*$D$128)-(DJ115+56),\"E\")","v":"E"},{"$f":"IFERROR(((DK113+1)*$D$128)-(DK115+56),\"E\")","v":"E"},null,"⑩",{"$f":"IFERROR(((DN113+1)*$D$128)-(DN115+56),\"E\")","v":"E"},{"$f":"IFERROR(((DO113+1)*$D$128)-(DO115+56),\"E\")","v":"E"},{"$f":"IFERROR(((DP113+1)*$D$128)-(DP115+56),\"E\")","v":"E"},{"$f":"IFERROR(((DQ113+1)*$D$128)-(DQ115+56),\"E\")","v":"E"},{"$f":"IFERROR(((DR113+1)*$D$128)-(DR115+56),\"E\")","v":"E"}]
[null,"水平部分角度",null,null,null,{"$f":"IFERROR(IF(F116=\"ウェーブ\",F122-29.22,IF(F116=\"ウェーブS\",F122-27.98,\"\")),\"\")","v":""},null,"°",{"$f":"IFERROR(IF(N116=\"ウェーブ\",I122-29.22,IF(N116=\"ウェーブS\",I122-27.98,\"\")),\"\")","v":""},null,"°",{"$f":"IFERROR(IF(V116=\"ウェーブ\",L122-29.22,IF(V116=\"ウェーブS\",L122-27.98,\"\")),\"\")","v":""},null,"°",{"$f":"IFERROR(IF(AD116=\"ウェーブ\",O122-29.22,IF(AD116=\"ウェーブS\",O122-27.98,\"\")),\"\")","v":""},null,"°",null,null,null,null,null,null,null,null,{"$f":"IF(N116=\"\",\"未選択\",N116)","v":"未選択"},null,null,null,null,null,null,null,null,null,null,null,null,null,null,null,null,null,"上段まで",{"$f":"D126-AS122","v":{"$error":"#VALUE!"}},"段",null,null,null,null,null,null,null,null,"(G)-7.05～7.05°",{"$f":"IF(F116=\"\",\"△\",IF(OR(BD121=1,BD121=\"△\"),\"〇\",\"×\"))","v":"△"},{"$f":"IF(N116=\"\",\"△\",IF(OR(BE121=1,BE121=\"△\"),\"〇\",\"×\"))","v":"△"},{"$f":"IF(V116=\"\",\"△\",IF(OR(BF121=1,BF121=\"△\"),\"〇\",\"×\"))","v":"△"},{"$f":"IF(AD116=\"\",\"△\",IF(OR(BG121=1,BG121=\"△\"),\"〇\",\"×\"))","v":"△"},null,{"$f":"IF(OR(BI122=\"×\",BI118=\"E\",BI119=\"E\"),\"※設置不可\",\"設置可能\")","v":{"$error":"#N/A"}},{"$f":"IF(OR(BJ122=\"×\",BJ118=\"E\",BJ119=\"E\"),\"※設置不可\",\"設置可能\")","v":{"$error":"#N/A"}},{"$f":"IF(OR(BK122=\"×\",BK118=\"E\",BK119=\"E\"),\"※設置不可\",\"設置可能\")","v":{"$error":"#N/A"}},{"$f":"IF(OR(BL122=\"×\",BL118=\"E\",BL119=\"E\"),\"※設置不可\",\"設置可能\")","v":{"$error":"#N/A"}},{"$f":"IF(OR(BM122=\"×\",BM118=\"E\",BM119=\"E\"),\"※設置不可\",\"設置可能\")","v":{"$error":"#N/A"}},{"$f":"IFERROR(INDEX($BI$122:$BM$122, MATCH(N116,$BI$120:$BM$120,0)),\"×\")","v":"×"},null,"ショート判定",null,null,"ダブル判定",null,null,null,null,null,null,null,null,null,"①",{"$f":"IFERROR(CD117+(28*2),\"E\")","v":"E"},{"$f":"IFERROR(CE117+(28*2),\"E\")","v":"E"},{"$f":"IFERROR(CF117+(28*2),\"E\")","v":"E"},{"$f":"IFERROR(CG117+(28*2),\"E\")","v":"E"},{"$f":"IFERROR(CH117+(28*2),\"E\")","v":"E"},null,null,"⑦",{"$f":"IFERROR(CL115-((CL113-1)*$D$128),\"E\")","v":"E"},{"$f":"IFERROR(CM115-((CM113-1)*$D$128),\"E\")","v":"E"},{"$f":"IFERROR(CN115-((CN113-1)*$D$128),\"E\")","v":"E"},{"$f":"IFERROR(CO115-((CO113-1)*$D$128),\"E\")","v":"E"},{"$f":"IFERROR(CP115-((CP113-1)*$D$128),\"E\")","v":"E"},null,"⑦",{"$f":"IFERROR(CS115-((CS113-1)*$D$128),\"E\")","v":"E"},{"$f":"IFERROR(CT115-((CT113-1)*$D$128),\"E\")","v":"E"},{"$f":"IFERROR(CU115-((CU113-1)*$D$128),\"E\")","v":"E"},{"$f":"IFERROR(CV115-((CV113-1)*$D$128),\"E\")","v":"E"},{"$f":"IFERROR(CW115-((CW113-1)*$D$128),\"E\")","v":"E"},null,"⑦",{"$f":"IFERROR(CZ115-((CZ113-1)*$D$128),\"E\")","v":"E"},{"$f":"IFERROR(DA115-((DA113-1)*$D$128),\"E\")","v":"E"},{"$f":"IFERROR(DB115-((DB113-1)*$D$128),\"E\")","v":"E"},{"$f":"IFERROR(DC115-((DC113-1)*$D$128),\"E\")","v":"E"},{"$f":"IFERROR(DD115-((DD113-1)*$D$128),\"E\")","v":"E"},null,"⑦",{"$f":"IFERROR(DG115-((DG113-1)*$D$128),\"E\")","v":"E"},{"$f":"IFERROR(DH115-((DH113-1)*$D$128),\"E\")","v":"E"},{"$f":"IFERROR(DI115-((DI113-1)*$D$128),\"E\")","v":"E"},{"$f":"IFERROR(DJ115-((DJ113-1)*$D$128),\"E\")","v":"E"},{"$f":"IFERROR(DK115-((DK113-1)*$D$128),\"E\")","v":"E"},null,"⑦",{"$f":"IFERROR(DN115-((DN113-1)*$D$128),\"E\")","v":"E"},{"$f":"IFERROR(DO115-((DO113-1)*$D$128),\"E\")","v":"E"},{"$f":"IFERROR(DP115-((DP113-1)*$D$128),\"E\")","v":"E"},{"$f":"IFERROR(DQ115-((DQ113-1)*$D$128),\"E\")","v":"E"},{"$f":"IFERROR(DR115-((DR113-1)*$D$128),\"E\")","v":"E"}]
[null,null,null,null,null,null,null,null,null,null,null,null,null,null,null,null,null,null,null,null,null,null,null,null,null,null,null,null,null,{"$f":"IF(V116=\"\",\"未選択\",V116)","v":"未選択"},null,null,null,null,null,null,null,null,null,null,null,null,null,"蹴上",{"$f":"AS123*D127","v":{"$error":"#VALUE!"}},"㎝",null,null,null,null,null,null,null,null,"必要スペース",{"$f":"AL117","v":"〇"},"―","―",{"$f":"AM117","v":"〇"},null,null,null,null,{"$f":"BN124","v":{"$error":"#VALUE!"}},"⑫",{"$f":"(AX130+AY130+28)-((AX133+AY133-1)*D128)","v":{"$error":"#VALUE!"}},null,"上段","下段","チェック","上段","中間１","中間２","中間３","下段","チェック",null,null,null,null,"②",{"$f":"IFERROR(((CD119+1)*$D$128),\"E\")","v":"E"},{"$f":"IFERROR(((CE119+1)*$D$128),\"E\")","v":"E"},{"$f":"IFERROR(((CF119+1)*$D$128),\"E\")","v":"E"},{"$f":"IFERROR(((CG119+1)*$D$128),\"E\")","v":"E"},{"$f":"IFERROR(((CH119+1)*$D$128),\"E\")","v":"E"},null,"最小振り幅",null,{"$f":"IF(CL117=\"〇\",CL126,\"E\")","v":"E"},"E","E",{"$f":"IF(CO117=\"〇\",CO126,\"E\")","v":"E"},{"$f":"IF(CP117=\"〇\",CP126,\"E\")","v":"E"},"最小振り幅",null,{"$f":"IF(CS117=\"〇\",CS126,\"E\")","v":"E"},"E","E",{"$f":"IF(CV117=\"〇\",CV126,\"E\")","v":"E"},{"$f":"IF(CW117=\"〇\",CW126,\"E\")","v":"E"},"最小振り幅",null,{"$f":"IF(CZ117=\"〇\",CZ126,\"E\")","v":"E"},"E","E",{"$f":"IF(DC117=\"〇\",DC126,\"E\")","v":"E"},{"$f":"IF(DD117=\"〇\",DD126,\"E\")","v":"E"},"最小振り幅",null,{"$f":"IF(DG117=\"〇\",DG126,\"E\")","v":"E"},"E","E",{"$f":"IF(DJ117=\"〇\",DJ126,\"E\")","v":"E"},{"$f":"IF(DK117=\"〇\",DK126,\"E\")","v":"E"},"最小振り幅",null,{"$f":"IF(DN117=\"〇\",DN126,\"E\")","v":"E"},"E","E",{"$f":"IF(DQ117=\"〇\",DQ126,\"E\")","v":"E"},{"$f":"IF(DR117=\"〇\",DR126,\"E\")","v":"E"}]
[null,null,null,null,null,null,null,null,null,null,null,null,null,null,null,null,null,null,"上段",null,null,null,null,null,null,null,null,null,null,null,null,null,null,{"$f":"IF(AD116=\"\",\"未選択\",AD116)","v":"未選択"},null,null,null,null,null,null,null,null,null,"踏面",{"$f":"(AS123-1)*D128","v":{"$error":"#VALUE!"}},"㎝",null,null,null,null,null,null,null,null,"(A)72cm以下",{"$f":"IF(F121=\"\",\"△\",IF(F121<=72,\"〇\",\"×\"))","v":"△"},{"$f":"IF(I121=\"\",\"△\",IF(I121<=72,\"〇\",\"×\"))","v":"△"},{"$f":"IF(L121=\"\",\"△\",IF(L121<=72,\"〇\",\"×\"))","v":"△"},{"$f":"IF(O121=\"\",\"△\",IF(O121<=72,\"〇\",\"×\"))","v":"△"},null,null,null,null,{"$f":"BN125","v":{"$error":"#VALUE!"}},"③",{"$f":"BP127-BP126","v":{"$error":"#VALUE!"}},null,{"$f":"IF(OR(B116=\"ショート\",B116=\"ショートダブル\"),\"S\",\"\")","v":""},{"$f":"IF(OR(AH116=\"ショート\",AH116=\"ショートダブル\"),\"S\",\"\")","v":""},{"$f":"COUNTIFS(BP125:BQ125,\"S\")","v":0},{"$f":"IF(OR(B116=\"ダブル\",B116=\"ショートダブル\"),\"D\",\"\")","v":""},{"$f":"IF(OR(J116=\"ダブル\",J116=\"ショートダブル\"),\"D\",\"\")","v":""},{"$f":"IF(OR(R116=\"ダブル\",R116=\"ショートダブル\"),\"D\",\"\")","v":""},{"$f":"IF(OR(Z116=\"ダブル\",Z116=\"ショートダブル\"),\"D\",\"\")","v":""},{"$f":"IF(OR(AH116=\"ダブル\",AH116=\"ショートダブル\"),\"D\",\"\")","v":""},{"$f":"COUNTIFS(BS125:BW125,\"D\")","v":0},null,null,null,null,"①\"",{"$f":"IFERROR((CD119*$D$128)-(CD117+28),\"E\")","v":"E"},{"$f":"IFERROR((CE119*$D$128)-(CE117+28),\"E\")","v":"E"},{"$f":"IFERROR((CF119*$D$128)-(CF117+28),\"E\")","v":"E"},{"$f":"IFERROR((CG119*$D$128)-(CG117+28),\"E\")","v":"E"},{"$f":"IFERROR((CH119*$D$128)-(CH117+28),\"E\")","v":"E"},null,"F",null,{"$f":"IFERROR(CL124/2,\"\")","v":""},{"$f":"IFERROR(CM124/2,\"\")","v":""},{"$f":"IFERROR(CN124/2,\"\")","v":""},{"$f":"IFERROR(CO124/2,\"\")","v":""},{"$f":"IFERROR(CP124/2,\"\")","v":""},"F",null,{"$f":"IFERROR(CS124/2,\"\")","v":""},{"$f":"IFERROR(CT124/2,\"\")","v":""},{"$f":"IFERROR(CU124/2,\"\")","v":""},{"$f":"IFERROR(CV124/2,\"\")","v":""},{"$f":"IFERROR(CW124/2,\"\")","v":""},"F",null,{"$f":"IFERROR(CZ124/2,\"\")","v":""},{"$f":"IFERROR(DA124/2,\"\")","v":""},{"$f":"IFERROR(DB124/2,\"\")","v":""},{"$f":"IFERROR(DC124/2,\"\")","v":""},{"$f":"IFERROR(DD124/2,\"\")","v":""},"F",null,{"$f":"IFERROR(DG124/2,\"\")","v":""},{"$f":"IFERROR(DH124/2,\"\")","v":""},{"$f":"IFERROR(DI124/2,\"\")","v":""},{"$f":"IFERROR(DJ124/2,\"\")","v":""},{"$f":"IFERROR(DK124/2,\"\")","v":""},"F",null,{"$f":"IFERROR(DN124/2,\"\")","v":""},{"$f":"IFERROR(DO124/2,\"\")","v":""},{"$f":"IFERROR(DP124/2,\"\")","v":""},{"$f":"IFERROR(DQ124/2,\"\")","v":""},{"$f":"IFERROR(DR124/2,\"\")","v":""}]
[null,"段　数",null,{"$f":"$F$23","v":0},null,"段",null,null,null,null,null,null,null,null,null,null,null,{"$f":"IF(B116=\"\",\"未選択\",B116)","v":"シングル"},null,null,null,null,{"$f":"J115","v":""},null,null,null,null,null,null,null,null,null,null,null,null,null,null,null,null,null,null,null,null,"リ③F",{"$f":"CA118","v":0},null,null,{"$f":"COUNTIFS(AW133:AZ133,\"×\")","v":0},{"$f":"IFERROR(IF(AW133<=0,\"×\",AW133),\"×\")","v":"×"},null,null,{"$f":"IFERROR(IF(AZ133<=0,\"×\",AZ133),\"×\")","v":"×"},null,null,"連結判定",{"$f":"IF(F116=\"\",\"△\",IF(COUNTIFS(BD122:BD124,\"*×*\")>0,\"×\",\"〇\"))","v":"△"},"―","―",{"$f":"IF(AD116=\"\",\"△\",IF(COUNTIFS(BG122:BG124,\"*×*\")>0,\"×\",\"〇\"))","v":"△"},null,null,null,{"$f":"IF(BN125<(D128-28),BN125,(D128-28)-BR126)","v":{"$error":"#VALUE!"}},{"$f":"BN126","v":{"$error":"#VALUE!"}},"⑪",{"$f":"AX130-((AX133-1)*D128)","v":{"$error":"#VALUE!"}},"①",{"$f":"AX130+(28*2)","v":{"$error":"#VALUE!"}},"①\"",{"$f":"(AX133*D128)-(AX130+28)","v":{"$error":"#VALUE!"}},"④",{"$f":"IF(BN125<(D128-28),D128,((AY133-1)*D128)+BR126)","v":{"$error":"#VALUE!"}},600,900,1200,"ウェーブS","ウェーブ",null,null,null,"④",{"$f":"IFERROR(IF(CD128<($D$128-28),$D$128,((CL113-1)*$D$128)+CD125),\"E\")","v":"E"},{"$f":"IFERROR(IF(CE128<($D$128-28),$D$128,((CM113-1)*$D$128)+CE125),\"E\")","v":"E"},{"$f":"IFERROR(IF(CF128<($D$128-28),$D$128,((CN113-1)*$D$128)+CF125),\"E\")","v":"E"},{"$f":"IFERROR(IF(CG128<($D$128-28),$D$128,((CO113-1)*$D$128)+CG125),\"E\")","v":"E"},{"$f":"IFERROR(IF(CH128<($D$128-28),$D$128,((CP113-1)*$D$128)+CH125),\"E\")","v":"E"},null,null,null,{"$f":"MIN(IF(CL118:CL123>0,CL118:CL123))","v":0},{"$f":"MIN(IF(CM118:CM123>0,CM118:CM123))","v":0},{"$f":"MIN(IF(CN118:CN123>0,CN118:CN123))","v":0},{"$f":"MIN(IF(CO118:CO123>0,CO118:CO123))","v":0},{"$f":"MIN(IF(CP118:CP123>0,CP118:CP123))","v":0},null,null,{"$f":"MIN(IF(CS118:CS123>0,CS118:CS123))","v":0},{"$f":"MIN(IF(CT118:CT123>0,CT118:CT123))","v":0},{"$f":"MIN(IF(CU118:CU123>0,CU118:CU123))","v":0},{"$f":"MIN(IF(CV118:CV123>0,CV118:CV123))","v":0},{"$f":"MIN(IF(CW118:CW123>0,CW118:CW123))","v":0},null,null,{"$f":"MIN(IF(CZ118:CZ123>0,CZ118:CZ123))","v":0},{"$f":"MIN(IF(DA118:DA123>0,DA118:DA123))","v":0},{"$f":"MIN(IF(DB118:DB123>0,DB118:DB123))","v":0},{"$f":"MIN(IF(DC118:DC123>0,DC118:DC123))","v":0},{"$f":"MIN(IF(DD118:DD123>0,DD118:DD123))","v":0},null,null,{"$f":"MIN(IF(DG118:DG123>0,DG118:DG123))","v":0},{"$f":"MIN(IF(DH118:DH123>0,DH118:DH123))","v":0},{"$f":"MIN(IF(DI118:DI123>0,DI118:DI123))","v":0},{"$f":"MIN(IF(DJ118:DJ123>0,DJ118:DJ123))","v":0},{"$f":"MIN(IF(DK118:DK123>0,DK118:DK123))","v":0},null,null,{"$f":"MIN(IF(DN118:DN123>0,DN118:DN123))","v":0},{"$f":"MIN(IF(DO118:DO123>0,DO118:DO123))","v":0},{"$f":"MIN(IF(DP118:DP123>0,DP118:DP123))","v":0},{"$f":"MIN(IF(DQ118:DQ123>0,DQ118:DQ123))","v":0},{"$f":"MIN(IF(DR118:DR123>0,DR118:DR123))","v":0}]
[null,"蹴　上",null,{"$f":"$F$26","v":0},null,"㎝",null,null,null,null,null,null,null,null,null,null,null,null,null,null,null,null,{"$f":"J116","v":"ショート"},null,null,null,{"$f":"R115","v":""},null,null,null,null,null,null,null,null,null,null,null,null,null,null,null,null,"A下",{"$f":"AX130-(AS126+((AX133-1)*D128))","v":{"$error":"#VALUE!"}},null,null,null,"ア","イ","ウ","エ",null,null,null,null,null,null,null,null,null,null,{"$f":"IF(BN125<(D128-28),((AY133*D128)+BK126)-(AY130+28),((AY133*D128)+BK126+BR126)-(AY130+28))","v":{"$error":"#VALUE!"}},{"$f":"BN127","v":{"$error":"#VALUE!"}},"⑩",{"$f":"((AY133+1)*D128)-(AY130+56)","v":{"$error":"#VALUE!"}},"②",{"$f":"((AX133+1)*D128)","v":{"$error":"#VALUE!"}},null,null,"⑤",{"$f":"IF(BN125<(D128-28),((AY133*D128)-28)+BN125,((AY133+1)*D128)-(28*2))","v":{"$error":"#VALUE!"}},48.5,78.5,108.5,95.903999999999996,123.084,null,null,null,"⑤",{"$f":"IF(CD128<($D$128-28),((CL113*$D$128)-28)+CD128,((CL113+1)*$D$128)-(28*2))","v":{"$error":"#VALUE!"}},{"$f":"IF(CE128<($D$128-28),((CM113*$D$128)-28)+CE128,((CM113+1)*$D$128)-(28*2))","v":{"$error":"#VALUE!"}},{"$f":"IF(CF128<($D$128-28),((CN113*$D$128)-28)+CF128,((CN113+1)*$D$128)-(28*2))","v":{"$error":"#VALUE!"}},{"$f":"IF(CG128<($D$128-28),((CO113*$D$128)-28)+CG128,((CO113+1)*$D$128)-(28*2))","v":{"$error":"#VALUE!"}},{"$f":"IF(CH125<0,(((CP113+1)*$D$128)-(28*2))-(D128-28+CH125),IF(CH128<($D$128-28),((CP113*$D$128)-28)+CH128,((CP113+1)*$D$128)-(28*2)))","v":{"$error":"#VALUE!"}},null,null,null,{"$f":"IF(COUNTIF(CL118:CL123,\"<0\")>0,\"×\",IF(COUNTIF(CL118:CL123,\"E\")>0,\"×\",\"\"))","v":"×"},{"$f":"IF(COUNTIF(CM118:CM123,\"<0\")>0,\"×\",IF(COUNTIF(CM118:CM123,\"E\")>0,\"×\",\"\"))","v":"×"},{"$f":"IF(COUNTIF(CN118:CN123,\"<0\")>0,\"×\",IF(COUNTIF(CN118:CN123,\"E\")>0,\"×\",\"\"))","v":"×"},{"$f":"IF(COUNTIF(CO118:CO123,\"<0\")>0,\"×\",IF(COUNTIF(CO118:CO123,\"E\")>0,\"×\",\"\"))","v":"×"},{"$f":"IF(COUNTIF(CP118:CP123,\"<0\")>0,\"×\",IF(COUNTIF(CP118:CP123,\"E\")>0,\"×\",\"\"))","v":"×"},null,null,{"$f":"IF(COUNTIF(CS118:CS123,\"<0\")>0,\"×\",IF(COUNTIF(CS118:CS123,\"E\")>0,\"×\",\"\"))","v":"×"},"×","×","×","×",null,null,{"$f":"IF(COUNTIF(CZ118:CZ123,\"<0\")>0,\"×\",IF(COUNTIF(CZ118:CZ123,\"E\")>0,\"×\",\"\"))","v":"×"},"×","×","×","×",null,null,{"$f":"IF(COUNTIF(DG118:DG123,\"<0\")>0,\"×\",IF(COUNTIF(DG118:DG123,\"E\")>0,\"×\",\"\"))","v":"×"},"×","×",{"$f":"IF(COUNTIF(DJ118:DJ123,\"<0\")>0,\"×\",IF(COUNTIF(DJ118:DJ123,\"E\")>0,\"×\",\"\"))","v":"×"},{"$f":"IF(COUNTIF(DK118:DK123,\"<0\")>0,\"×\",IF(COUNTIF(DK118:DK123,\"E\")>0,\"×\",\"\"))","v":"×"},null,null,{"$f":"IF(COUNTIF(DN118:DN123,\"<0\")>0,\"×\",IF(COUNTIF(DN118:DN123,\"E\")>0,\"×\",\"\"))","v":"×"},"×","×","×","×"]
[null,"踏　面",null,{"$f":"$F$29","v":0},null,"㎝",null,null,null,null,null,null,null,null,null,null,null,null,null,null,null,null,null,null,null,null,{"$f":"R116","v":"ショート"},null,null,null,{"$f":"Z115","v":""},null,null,null,null,null,null,null,null,null,null,null,null,"A上",{"$f":"D128-(28+AS127)","v":{"$error":"#VALUE!"}},null,null,"最小ベース間距離",{"$f":"IF(F29=\"\",\"△\",IF(AW133=\"×\",\"×\",AS139+((AW133-1)*D128)))","v":"△"},{"$f":"IFERROR($AY$117-($AW$116+$AW$118),\"\")","v":""},{"$f":"IFERROR($AY$119-($AW$118+$AW$120),\"\")","v":""},{"$f":"IF(F29=\"\",\"△\",IF(AZ133=\"×\",\"×\",AS139+((AZ133-1)*D128)))","v":"△"},null,null,"①”＜０の場合",null,null,{"$f":"IFERROR(IF(AS121=\"×\",\"×\",IF(BR126>=0,ROUNDUP(BM132,0),IF(OR(BF129=\"E\",BH129=\"E\"),ROUNDUP(BM132,0),IF(BR126<0,ROUNDUP(BF129,0),ROUNDUP(BM132,0))))),\"\")","v":""},null,{"$f":"IFERROR(IF(BR126>=0,ROUNDUP(BN132,0),IF(OR(BH129=\"E\",BF129=\"E\"),ROUNDUP(BN132,0),IF(BR126<0,ROUNDUP(BH129,0),IF(BN132>=AZ122,ROUNDUP(BN132,0),\"×\")))),\"\")","v":""},null,null,null,{"$f":"BN128","v":{"$error":"#VALUE!"}},"⑦",{"$f":"AY130-((AY133-1)*D128)","v":{"$error":"#VALUE!"}},"ウ)最大べ距離",null,{"$f":"((CL113+1)*D128)-56","v":{"$error":"#VALUE!"}},null,"支柱間距離",null,{"$f":"((BU127^2-$BQ$129^2)^0.5)+(7.99*2)","v":{"$error":"#VALUE!"}},{"$f":"((BV127^2-$BQ$129^2)^0.5)+(7.99*2)","v":{"$error":"#VALUE!"}},{"$f":"((BW127^2-$BQ$129^2)^0.5)+(7.99*2)","v":{"$error":"#VALUE!"}},{"$f":"((BX127^2-$BQ$129^2)^0.5)+(7.99*2)","v":{"$error":"#VALUE!"}},{"$f":"((BY127^2-$BQ$129^2)^0.5)+(7.99*2)","v":{"$error":"#VALUE!"}},null,null,null,"③",{"$f":"IFERROR(CD124-CD123,\"E\")","v":"E"},{"$f":"IFERROR(CE124-CE123,\"E\")","v":"E"},{"$f":"IFERROR(CF124-CF123,\"E\")","v":"E"},{"$f":"IFERROR(CG124-CG123,\"E\")","v":"E"},{"$f":"IFERROR(CH124-CH123,\"E\")","v":"E"},null,"①イウベ距離",null,{"$f":"$CD$117+CL115+28","v":{"$error":"#VALUE!"}},{"$f":"$CD$117+CM115+28","v":{"$error":"#VALUE!"}},{"$error":"#VALUE!"},{"$error":"#VALUE!"},{"$f":"$CD$117+CP115+28","v":{"$error":"#VALUE!"}},null,null,{"$f":"$CE$117+CS115+28","v":{"$error":"#VALUE!"}},{"$f":"$CE$117+CT115+28","v":{"$error":"#VALUE!"}},{"$error":"#VALUE!"},{"$error":"#VALUE!"},{"$f":"$CE$117+CW115+28","v":{"$error":"#VALUE!"}},null,null,{"$f":"$CF$117+CZ115+28","v":{"$error":"#VALUE!"}},{"$f":"$CF$117+DA115+28","v":{"$error":"#VALUE!"}},{"$error":"#VALUE!"},{"$error":"#VALUE!"},{"$f":"$CF$117+DD115+28","v":{"$error":"#VALUE!"}},null,null,{"$f":"$CG$117+DG115+28","v":{"$error":"#VALUE!"}},{"$f":"$CG$117+DH115+28","v":{"$error":"#VALUE!"}},{"$error":"#VALUE!"},{"$error":"#VALUE!"},{"$error":"#VALUE!"},null,null,{"$f":"$CH$117+DN115+28","v":{"$error":"#VALUE!"}},{"$f":"$CH$117+DO115+28","v":{"$error":"#VALUE!"}},{"$error":"#VALUE!"},{"$error":"#VALUE!"},{"$f":"$CH$117+DR115+28","v":{"$error":"#VALUE!"}}]
[null,"【シミュレーション結果の各種TAISコード】",null,null,null,null,null,null,null,null,null,null,null,null,null,null,null,null,null,null,null,null,null,null,null,null,null,null,null,null,{"$f":"Z116","v":"ショート"},null,null,null,null,"下段",null,{"$f":"IF(AH116=\"\",\"未選択\",IF(AH116=\"ショート不可\",\"不可\",AH116))","v":"シングル"},null,null,null,null,null,"最小ア）ベ距離",{"$f":"AS128+((AW133-1)*D128)","v":{"$error":"#VALUE!"}},null,null,"必要最大ﾍﾞｰｽ間",{"$f":"IF(F121=\"\",\"△\",(((123.084^2-F121^2)^0.5)+(7.99*2))-(10+7.5))","v":"△"},null,null,{"$f":"IF(O121=\"\",\"△\",(((123.084^2-O121^2)^0.5)+(7.99*2))-(10+7.5))","v":"△"},null,null,null,null,"上段必スぺ",{"$f":"IF(OR(BF130<0,BF131<0),\"E\",AZ114+BF132)","v":{"$error":"#VALUE!"}},"下段必スぺ",{"$f":"IF(OR(BH130<0,BH131<0),\"E\",AZ122+BH132)","v":{"$error":"#VALUE!"}},null,null,null,{"$error":"#VALUE!"},"⑬",{"$f":"((AX133+AY133+1)*D128)-(AX130+AY130+28+56)","v":{"$error":"#VALUE!"}},"ウ)段差",null,{"$f":"(AS122-BQ131)*D127","v":{"$error":"#VALUE!"}},null,"ベース間距離",null,{"$f":"IFERROR(BU128-(7.5+7.5),\"\")","v":""},{"$f":"IFERROR(BV128-(7.5+7.5),\"\")","v":""},"","","",null,null,null,"⑪",{"$f":"IFERROR(CD117-((CD119-1)*$D$128),\"E\")","v":"E"},{"$f":"IFERROR(CE117-((CE119-1)*$D$128),\"E\")","v":"E"},{"$f":"IFERROR(CF117-((CF119-1)*$D$128),\"E\")","v":"E"},{"$f":"IFERROR(CG117-((CG119-1)*$D$128),\"E\")","v":"E"},{"$f":"IFERROR(CH117-((CH119-1)*$D$128),\"E\")","v":"E"},null,"②イウ総距離",null,{"$f":"CL128+56","v":{"$error":"#VALUE!"}},{"$f":"CM128+56","v":{"$error":"#VALUE!"}},{"$error":"#VALUE!"},{"$error":"#VALUE!"},{"$error":"#VALUE!"},null,null,{"$f":"CS128+56","v":{"$error":"#VALUE!"}},{"$error":"#VALUE!"},{"$error":"#VALUE!"},{"$error":"#VALUE!"},{"$error":"#VALUE!"},null,null,{"$f":"CZ128+56","v":{"$error":"#VALUE!"}},{"$error":"#VALUE!"},{"$error":"#VALUE!"},{"$error":"#VALUE!"},{"$error":"#VALUE!"},null,null,{"$f":"DG128+56","v":{"$error":"#VALUE!"}},{"$error":"#VALUE!"},{"$error":"#VALUE!"},{"$error":"#VALUE!"},{"$error":"#VALUE!"},null,null,{"$f":"DN128+56","v":{"$error":"#VALUE!"}},{"$error":"#VALUE!"},{"$error":"#VALUE!"},{"$error":"#VALUE!"},{"$error":"#VALUE!"}]
[null,null,null,null,null,null,null,null,null,null,null,null,null,null,null,null,null,null,null,null,null,null,null,null,null,null,null,null,null,null,null,null,null,null,null,null,null,null,null,null,null,null,null,null,null,null,null,"ベース間距離",{"$f":"IFERROR($AY$115-($AW$114+$AW$116),\"\")","v":""},{"$f":"IFERROR($AY$117-($AW$116+$AW$118),\"\")","v":""},{"$f":"IFERROR($AY$119-($AW$118+$AW$120),\"\")","v":""},{"$f":"IFERROR($AY$121-($AW$120+$AW$122),\"\")","v":""},null,null,"Ａ上",0,"Ｂ上",{"$f":"AX130-(((AX133-1)*D128)+BD131)","v":{"$error":"#VALUE!"}},"Ｃ上",{"$f":"AY130-(((AY133-1)*D128)+BF131 )","v":{"$error":"#VALUE!"}},null,null,null,"最小振幅",{"$f":"VLOOKUP(BN130,BL124:BM129,2,0)","v":{"$error":"#VALUE!"}},{"$f":"MIN(BN124:BN129)","v":{"$error":"#VALUE!"}},"ウ)段数",null,{"$f":"AS122-BQ131","v":{"$error":"#VALUE!"}},null,null,null,null,null,null,null,null,null,null,null,null,null,null,null,null,null,null,"③イウ段数",null,{"$f":"$CD$119+CL113","v":{"$error":"#VALUE!"}},{"$f":"$CD$119+CM113","v":{"$error":"#VALUE!"}},{"$error":"#VALUE!"},{"$error":"#VALUE!"},{"$f":"$CD$119+CP113","v":{"$error":"#VALUE!"}},null,null,{"$f":"$CE$119+CS113","v":{"$error":"#VALUE!"}},{"$f":"$CE$119+CT113","v":{"$error":"#VALUE!"}},{"$error":"#VALUE!"},{"$error":"#VALUE!"},{"$f":"$CE$119+CW113","v":{"$error":"#VALUE!"}},null,null,{"$f":"$CF$119+CZ113","v":{"$error":"#VALUE!"}},{"$f":"$CF$119+DA113","v":{"$error":"#VALUE!"}},{"$error":"#VALUE!"},{"$error":"#VALUE!"},{"$error":"#VALUE!"},null,null,{"$f":"$CG$119+DG113","v":{"$error":"#VALUE!"}},{"$f":"$CG$119+DH113","v":{"$error":"#VALUE!"}},{"$error":"#VALUE!"},{"$error":"#VALUE!"},{"$error":"#VALUE!"},null,null,{"$f":"$CH$119+DN113","v":{"$error":"#VALUE!"}},{"$f":"$CH$119+DO113","v":{"$error":"#VALUE!"}},{"$error":"#VALUE!"},{"$error":"#VALUE!"},{"$f":"$CH$119+DR113","v":{"$error":"#VALUE!"}}]
[null,{"$f":"IF(OR(F112=\"×\",F112=\"\",F112=\"△\"),\"\",IF(OR(B116=\"\",F116=\"\"),\"\",IF(OR(B116=\"ダブル\",B116=\"ショートダブル\"),B116&\"＋連結バー\"&F116&\" 2本セット\",B116&\"+連結バー\"&F116&\" セット\")))","v":""},null,null,null,null,null,null,null,{"$f":"IF(OR(F112=\"×\",F112=\"\",F112=\"△\"),\"\",IF(OR(J116=\"\",N116=\"\"),\"\",IF(OR(J116=\"ダブル\",J116=\"ショートダブル\"),J116&\"＋連結バー\"&N116&\" 2本セット\",J116&\"+連結バー\"&N116&\" セット\")))","v":""},null,null,null,null,null,null,null,{"$f":"IF(OR(F112=\"×\",F112=\"\",F112=\"△\"),\"\",IF(OR(R116=\"\",V116=\"\"),\"\",IF(OR(R116=\"ダブル\",R116=\"ショートダブル\"),R116&\"＋連結バー\"&V116&\" 2本セット\",R116&\"+連結バー\"&V116&\" セット\")))","v":""},null,null,null,null,null,null,null,{"$f":"IF(OR(F112=\"×\",F112=\"\",F112=\"△\"),\"\",IF(OR(Z116=\"\",AD116=\"\"),\"\",IF(OR(Z116=\"ダブル\",Z116=\"ショートダブル\"),Z116&\"＋連結バー\"&AD116&\" 2本セット\",Z116&\"+連結バー\"&AD116&\" セット\")))","v":""},null,null,null,null,null,null,null,{"$f":"IF(OR(F112=\"×\",F112=\"\",F112=\"△\"),\"\",IF(AH116=\"\",\"\",AH116&\" ※単体\"))","v":""},null,null,null,null,null,null,null,null,1,"イ)ウ）ベ距離",{"$f":"AX130+AY130+28","v":{"$error":"#VALUE!"}},null,null,"最小斜辺",{"$f":"IFERROR(( AW132^2 +F121^2)^0.5,\"\")","v":""},{"$f":"IFERROR(( AX132^2 +I121^2)^0.5,\"\")","v":""},{"$f":"IFERROR(( AY132^2 +L121^2)^0.5,\"\")","v":""},{"$f":"IFERROR(( AZ132^2 +O121^2)^0.5,\"\")","v":""},null,null,"Ａ下",{"$f":"$D$128-28-BD130","v":-28},"Ｂ下",{"$f":"$D$128-28-BF130","v":{"$error":"#VALUE!"}},"Ｃ下",{"$f":"$D$128-28-BH130","v":{"$error":"#VALUE!"}},null,null,null,"必要S","上段","下段","リ④設置段",null,{"$f":"ROUNDDOWN(AS122/2,0)","v":{"$error":"#VALUE!"}},null,null,"連結可",{"$f":"IFERROR(IF(OR(BU132=\"\",BU133=\"\"),\"\",IF(BU129<$BT$126,\"\",IF(BU129>$BT$127,\"\",\"〇\"))),\"\")","v":""},{"$f":"IFERROR(IF(OR(BV132=\"\",BV133=\"\"),\"\",IF(BV129<$BT$126,\"\",IF(BV129>$BT$127,\"\",\"〇\"))),\"\")","v":""},{"$f":"IFERROR(IF(OR(BW132=\"\",BW133=\"\"),\"\",IF(BW129<$BT$126,\"\",IF(BW129>$BT$127,\"\",\"〇\"))),\"\")","v":""},{"$f":"IFERROR(IF(OR(BX132=\"\",BX133=\"\"),\"\",IF(BX129<$BT$126,\"\",IF(BX129>$BT$127,\"\",IF(L121<35,\"\",IF(L121>55,\"\",\"〇\"))))),\"\")","v":""},{"$f":"IFERROR(IF(OR(BY132=\"\",BY133=\"\"),\"\",IF(BY129<$BT$126,\"\",IF(BY129>$BT$127,\"\",IF(L121<47,\"\",IF(L121>72,\"\",\"〇\"))))),\"\")","v":""},null,null,null,null,null,null,null,null,null,null,"④イウ総踏面",null,{"$f":"(CL130+1)*$D$128","v":{"$error":"#VALUE!"}},{"$f":"(CM130+1)*$D$128","v":{"$error":"#VALUE!"}},{"$error":"#VALUE!"},{"$error":"#VALUE!"},{"$error":"#VALUE!"},null,null,{"$f":"(CS130+1)*$D$128","v":{"$error":"#VALUE!"}},{"$error":"#VALUE!"},{"$error":"#VALUE!"},{"$error":"#VALUE!"},{"$error":"#VALUE!"},null,null,{"$f":"(CZ130+1)*$D$128","v":{"$error":"#VALUE!"}},{"$error":"#VALUE!"},{"$error":"#VALUE!"},{"$error":"#VALUE!"},{"$error":"#VALUE!"},null,null,{"$f":"(DG130+1)*$D$128","v":{"$error":"#VALUE!"}},{"$error":"#VALUE!"},{"$error":"#VALUE!"},{"$error":"#VALUE!"},{"$error":"#VALUE!"},null,null,{"$f":"(DN130+1)*$D$128","v":{"$error":"#VALUE!"}},{"$error":"#VALUE!"},{"$error":"#VALUE!"},{"$error":"#VALUE!"},{"$error":"#VALUE!"}]
[null,{"$f":"IFERROR(IF(OR(F112=\"×\",F112=\"\",F112=\"△\"),\"\",INDEX(TAISﾘｽﾄ!$B$3:$L$19,MATCH(B116,TAISﾘｽﾄ!$A$3:$A$19,0),MATCH(F116,TAISﾘｽﾄ!$B$2:$L$2,0))),\"E\")","v":""},null,null,null,null,null,null,null,{"$f":"IFERROR(IF(OR(F112=\"×\",F112=\"\",F112=\"△\"),\"\",INDEX(TAISﾘｽﾄ!$B$3:$L$19,MATCH(J116,TAISﾘｽﾄ!$A$3:$A$19,0),MATCH(N116,TAISﾘｽﾄ!$B$2:$L$2,0))),\"E\")","v":""},null,null,null,null,null,null,null,{"$f":"IFERROR(IF(OR(F112=\"×\",F112=\"\",F112=\"△\"),\"\",INDEX(TAISﾘｽﾄ!$B$3:$L$19,MATCH(R116,TAISﾘｽﾄ!$A$3:$A$19,0),MATCH(V116,TAISﾘｽﾄ!$B$2:$L$2,0))),\"E\")","v":""},null,null,null,null,null,null,null,{"$f":"IFERROR(IF(OR(F112=\"×\",F112=\"\",F112=\"△\"),\"\",INDEX(TAISﾘｽﾄ!$B$3:$L$19,MATCH(Z116,TAISﾘｽﾄ!$A$3:$A$19,0),MATCH(AD116,TAISﾘｽﾄ!$B$2:$L$2,0))),\"E\")","v":""},null,null,null,null,null,null,null,{"$f":"IFERROR(IF(OR(F112=\"×\",F112=\"\",F112=\"△\"),\"\",INDEX(TAISﾘｽﾄ!B3:B19,MATCH(AH116,TAISﾘｽﾄ!A3:A19,0))),\"E\")","v":""},null,null,null,null,null,null,null,null,2,"イ)ウ）総距離",{"$f":"AS131+56","v":{"$error":"#VALUE!"}},null,null,"最小底辺",{"$f":"IF(AW128=\"×\",\"×\",(AW128+AW114+AW116)-(7.99*2))","v":{"$error":"#VALUE!"}},{"$f":"(AX128+AW116+AW118)-(7.99*2)","v":{"$error":"#VALUE!"}},{"$f":"(AY128+AW118+AW120)-(7.99*2)","v":{"$error":"#VALUE!"}},{"$f":"IF(AZ128=\"×\",\"×\",(AZ128+AW120+AW122)-(7.99*2))","v":{"$error":"#VALUE!"}},null,null,null,null,"Ｘ",{"$f":"$AW$130-((($AW$133-1)*$D$128)+BD130)","v":{"$error":"#VALUE!"}},"Ｙ",{"$f":"$AZ$130-((($AZ$133-1)*$D$128)+BH131)","v":{"$error":"#VALUE!"}},null,null,null,null,{"$f":"VLOOKUP(BM130,BK137:BL142,2,0)","v":{"$error":"#VALUE!"}},{"$f":"VLOOKUP(BM130,BM137:BN142,2,0)","v":{"$error":"#VALUE!"}},"採用振幅","F",{"$f":"BN130/2","v":{"$error":"#VALUE!"}},null,null,{"$f":"IF(COUNTIF(BI123:BM123,\"設置可能\")>0,\"〇\",\"×\")","v":"×"},{"$f":"IF($BT$132=\"×\",\"\",IF(AND(CL137=\"\",CS137=\"\",CZ137=\"\",DG137=\"\",DN137=\"\"),\"\",\"〇\"))","v":""},{"$f":"IF($BT$132=\"×\",\"\",IF(AND(CO137=\"\",CV137=\"\",DC137=\"\",DJ137=\"\",DQ137=\"\"),\"\",\"〇\"))","v":""},{"$f":"IF($BT$132=\"×\",\"\",IF(AND(CM137=\"\",CT137=\"\",DA137=\"\",DH137=\"\",DO137=\"\"),\"\",\"〇\"))","v":""},{"$f":"IF($BT$132=\"×\",\"\",IF(AND(CN137=\"\",CU137=\"\",DB137=\"\",DI137=\"\",DP137=\"\"),\"\",\"〇\"))","v":""},{"$f":"IF($BT$132=\"×\",\"\",IF(AND(CP137=\"\",CW137=\"\",DD137=\"\",DK137=\"\",DR137=\"\"),\"\",\"〇\"))","v":""},null,null,null,null,null,null,null,null,null,null,"⑦",null,{"$f":"(((CL131-CL129)/2)-$CD$118)+$CD$118","v":{"$error":"#VALUE!"}},{"$f":"(((CM131-CM129)/2)-$CD$118)+$CD$118","v":{"$error":"#VALUE!"}},{"$error":"#VALUE!"},{"$error":"#VALUE!"},{"$f":"(((CP131-CP129)/2)-$CD$118)+$CD$118","v":{"$error":"#VALUE!"}},null,null,{"$f":"(((CS131-CS129)/2)-$CE$118)+$CE$118","v":{"$error":"#VALUE!"}},{"$error":"#VALUE!"},{"$error":"#VALUE!"},{"$error":"#VALUE!"},{"$f":"(((CW131-CW129)/2)-$CE$118)+$CE$118","v":{"$error":"#VALUE!"}},null,null,{"$f":"(((CZ131-CZ129)/2)-$CF$118)+$CF$118","v":{"$error":"#VALUE!"}},{"$f":"(((DA131-DA129)/2)-$CF$118)+$CF$118","v":{"$error":"#VALUE!"}},{"$error":"#VALUE!"},{"$error":"#VALUE!"},{"$f":"(((DD131-DD129)/2)-$CF$118)+$CF$118","v":{"$error":"#VALUE!"}},null,null,{"$f":"(((DG131-DG129)/2)-$CG$118)+$CG$118","v":{"$error":"#VALUE!"}},{"$f":"(((DH131-DH129)/2)-$CG$118)+$CG$118","v":{"$error":"#VALUE!"}},{"$f":"(((DI131-DI129)/2)-$CG$118)+$CG$118","v":{"$error":"#VALUE!"}},{"$f":"(((DJ131-DJ129)/2)-$CG$118)+$CG$118","v":{"$error":"#VALUE!"}},{"$f":"(((DK131-DK129)/2)-$CG$118)+$CG$118","v":{"$error":"#VALUE!"}},null,null,{"$f":"(((DN131-DN129)/2)-$CH$118)+$CH$118","v":{"$error":"#VALUE!"}},{"$f":"(((DO131-DO129)/2)-$CH$118)+$CH$118","v":{"$error":"#VALUE!"}},{"$error":"#VALUE!"},{"$error":"#VALUE!"},{"$f":"(((DR131-DR129)/2)-$CH$118)+$CH$118","v":{"$error":"#VALUE!"}}]
[null,null,null,null,null,null,null,null,null,null,null,null,null,null,null,null,null,null,null,null,null,null,null,null,null,null,null,null,null,null,null,null,null,null,null,null,null,null,null,null,null,null,"③","イ)ウ）段数",{"$f":"AX133+AY133","v":{"$error":"#VALUE!"}},null,null,"段　数",{"$f":"IF(ROUNDDOWN(($F$23-(AX133+AY133))/2,0)<=0,\"×\",AS123-AX133)","v":{"$error":"#VALUE!"}},{"$f":"IFERROR($BN$123+1,\"\")","v":""},{"$f":"AS122-BQ131","v":{"$error":"#VALUE!"}},{"$f":"IF(AW133=\"×\",\"×\",F23-AY133-AX133-AW133)","v":{"$error":"#VALUE!"}},null,null,null,null,null,null,null,null,null,null,null,null,null,null,null,null,null,null,null,null,{"$f":"IF(N116=\"600\",CL137,IF(N116=\"900\",DG137,IF(N116=\"1200\",CS137,IF(N116=\"ウェーブS\",CZ137,IF(N116=\"ウェーブ\",DN137,\"\")))))","v":""},{"$f":"IF(N116=\"600\",CO137,IF(N116=\"900\",DJ137,IF(N116=\"1200\",CV137,IF(N116=\"ウェーブS\",DC137,IF(N116=\"ウェーブ\",DQ137,\"\")))))","v":""},{"$f":"IF(N116=\"600\",CM137,IF(N116=\"900\",DH137,IF(N116=\"1200\",CT137,IF(N116=\"ウェーブS\",DA137,IF(N116=\"ウェーブ\",DO137,\"\")))))","v":""},{"$f":"IF(N116=\"600\",CN137,IF(N116=\"900\",DI137,IF(N116=\"1200\",CU137,IF(N116=\"ウェーブS\",DB137,IF(N116=\"ウェーブ\",DP137,\"\")))))","v":""},{"$f":"IF(N116=\"600\",CP137,IF(N116=\"900\",DK137,IF(N116=\"1200\",CW137,IF(N116=\"ウェーブS\",DD137,IF(N116=\"ウェーブ\",DR137,\"\")))))","v":""},null,null,null,null,null,null,null,null,null,null,"ア最小ベ距離",null,{"$f":"IFERROR(IF($F$29=\"\",\"△\",IF(CT99=\"×\",\"×\",IF(CL132<0,\"E\",CL132+((CT99-1)*$D$128)))),\"E\")","v":"△"},{"$f":"IFERROR(IF($F$29=\"\",\"△\",IF(CT99=\"×\",\"×\",IF(CM132<0,\"E\",CM132+((CT99-1)*$D$128)))),\"E\")","v":"△"},{"$f":"IFERROR(IF($F$29=\"\",\"△\",IF(CT99=\"×\",\"×\",IF(CN132<0,\"E\",CN132+((CT99-1)*$D$128)))),\"E\")","v":"△"},{"$f":"IFERROR(IF($F$29=\"\",\"△\",IF(CT99=\"×\",\"×\",IF(CO132<0,\"E\",CO132+((CT99-1)*$D$128)))),\"E\")","v":"△"},{"$f":"IFERROR(IF($F$29=\"\",\"△\",IF(CT99=\"×\",\"×\",IF(CP132<0,\"E\",CP132+((CT99-1)*$D$128)))),\"E\")","v":"△"},{"$f":"IF(MIN(CL133:CP135)=0,\"\",MIN(CL133:CP135))","v":""},null,{"$f":"IFERROR(IF($F$29=\"\",\"△\",IF(CT100=\"×\",\"×\",IF(CS132<0,\"E\",CS132+((CT100-1)*$D$128)))),\"E\")","v":"△"},{"$f":"IFERROR(IF($F$29=\"\",\"△\",IF(CT100=\"×\",\"×\",IF(CT132<0,\"E\",CT132+((CT100-1)*$D$128)))),\"E\")","v":"△"},{"$f":"IFERROR(IF($F$29=\"\",\"△\",IF(CT100=\"×\",\"×\",IF(CU132<0,\"E\",CU132+((CT100-1)*$D$128)))),\"E\")","v":"△"},{"$f":"IFERROR(IF($F$29=\"\",\"△\",IF(CT100=\"×\",\"×\",IF(CV132<0,\"E\",CV132+((CT100-1)*$D$128)))),\"E\")","v":"△"},{"$f":"IFERROR(IF($F$29=\"\",\"△\",IF(CT100=\"×\",\"×\",IF(CW132<0,\"E\",CW132+((CT100-1)*$D$128)))),\"E\")","v":"△"},{"$f":"IF(MIN(CS133:CW135)=0,\"\",MIN(CS133:CW135))","v":""},null,{"$f":"IFERROR(IF($F$29=\"\",\"△\",IF(CT101=\"×\",\"×\",IF(CZ132<0,\"E\",CZ132+((CT101-1)*$D$128)))),\"E\")","v":"△"},{"$f":"IFERROR(IF($F$29=\"\",\"△\",IF(CT101=\"×\",\"×\",IF(DA132<0,\"E\",DA132+((CT101-1)*$D$128)))),\"E\")","v":"△"},{"$f":"IFERROR(IF($F$29=\"\",\"△\",IF(CT101=\"×\",\"×\",IF(DB132<0,\"E\",DB132+((CT101-1)*$D$128)))),\"E\")","v":"△"},{"$f":"IFERROR(IF($F$29=\"\",\"△\",IF(CT101=\"×\",\"×\",IF(DC132<0,\"E\",DC132+((CT101-1)*$D$128)))),\"E\")","v":"△"},{"$f":"IFERROR(IF($F$29=\"\",\"△\",IF(CT101=\"×\",\"×\",IF(DD132<0,\"E\",DD132+((CT101-1)*$D$128)))),\"E\")","v":"△"},{"$f":"IF(MIN(CZ133:DD135)=0,\"\",MIN(CZ133:DD135))","v":""},null,{"$f":"IFERROR(IF($F$29=\"\",\"△\",IF(CT102=\"×\",\"×\",IF(DG132<0,\"E\",DG132+((CT102-1)*$D$128)))),\"E\")","v":"△"},{"$f":"IFERROR(IF($F$29=\"\",\"△\",IF(CT102=\"×\",\"×\",IF(DH132<0,\"E\",DH132+((CT102-1)*$D$128)))),\"E\")","v":"△"},{"$f":"IFERROR(IF($F$29=\"\",\"△\",IF(CT102=\"×\",\"×\",IF(DI132<0,\"E\",DI132+((CT102-1)*$D$128)))),\"E\")","v":"△"},{"$f":"IFERROR(IF($F$29=\"\",\"△\",IF(CT102=\"×\",\"×\",IF(DJ132<0,\"E\",DJ132+((CT102-1)*$D$128)))),\"E\")","v":"△"},{"$f":"IFERROR(IF($F$29=\"\",\"△\",IF(CT102=\"×\",\"×\",IF(DK132<0,\"E\",DK132+((CT102-1)*$D$128)))),\"E\")","v":"△"},{"$f":"IF(MIN(DG133:DK135)=0,\"\",MIN(DG133:DK135))","v":""},null,{"$f":"IFERROR(IF($F$29=\"\",\"△\",IF(CT103=\"×\",\"×\",IF(DN132<0,\"E\",DN132+((CT103-1)*$D$128)))),\"E\")","v":"△"},{"$f":"IFERROR(IF($F$29=\"\",\"△\",IF(CT103=\"×\",\"×\",IF(DO132<0,\"E\",DO132+((CT103-1)*$D$128)))),\"E\")","v":"△"},{"$f":"IFERROR(IF($F$29=\"\",\"△\",IF(CT103=\"×\",\"×\",IF(DP132<0,\"E\",DP132+((CT103-1)*$D$128)))),\"E\")","v":"△"},{"$f":"IFERROR(IF($F$29=\"\",\"△\",IF(CT103=\"×\",\"×\",IF(DQ132<0,\"E\",DQ132+((CT103-1)*$D$128)))),\"E\")","v":"△"},{"$f":"IFERROR(IF($F$29=\"\",\"△\",IF(CT103=\"×\",\"×\",IF(DR132<0,\"E\",DR132+((CT103-1)*$D$128)))),\"E\")","v":"△"},{"$f":"IF(MIN(DN133:DR135)=0,\"\",MIN(DN133:DR135))","v":""}]
[]
[]
[null,null,null,null,null,null,null,null,null,null,null,null,null,null,null,null,null,null,null,null,null,null,null,null,null,null,null,null,null,null,null,null,null,null,null,null,null,null,null,null,null,null,"④","イ)ウ）総踏面",{"$f":"(AS133+1)*D128","v":{"$error":"#VALUE!"}},null,null,"シングル",null,null,null,null,null,null,null,null,null,null,null,null,null,null,"上段必Ｓ",null,"下段必Ｓ",null,null,null,"③","⑪","⑩","⑦","⑫","⑬",null,null,null,null,null,null,null,null,null,null,null,null,null,null,null,{"$f":"IFERROR(IF(CL133<=$AW$129,\"〇\",\"\"),\"E\")","v":"〇"},{"$f":"IFERROR(IF(CM133<=$AW$129,\"〇\",\"\"),\"E\")","v":"〇"},"〇","〇","〇",null,null,{"$f":"IFERROR(IF(CS133<=$AW$129,\"〇\",\"\"),\"E\")","v":"〇"},"〇","〇","〇","〇",null,null,{"$f":"IFERROR(IF(CZ133<=$AW$129,\"〇\",\"\"),\"E\")","v":"〇"},"〇","〇","〇","〇",null,null,{"$f":"IFERROR(IF(DG133<=$AW$129,\"〇\",\"\"),\"E\")","v":"〇"},"〇","〇","〇","〇",null,null,{"$f":"IFERROR(IF(DN133<=$AW$129,\"〇\",\"\"),\"E\")","v":"〇"},"〇","〇","〇","〇"]
[null,null,null,null,null,null,null,null,null,null,null,null,null,null,null,null,null,null,null,null,null,null,null,null,null,null,null,null,null,null,null,null,null,null,null,null,null,null,null,null,null,null,"⑤","④-②",{"$f":"AS136-AS132","v":{"$error":"#VALUE!"}},null,null,"ショート",null,null,null,null,null,null,null,null,null,null,null,null,null,null,"③",{"$f":"BQ143+AZ114","v":{"$error":"#VALUE!"}},"③",{"$f":"BQ144+$AZ$122","v":{"$error":"#VALUE!"}},null,"Ａ上",{"$f":"$D$128-(BQ138+28)","v":{"$error":"#VALUE!"}},{"$error":"#VALUE!"},{"$f":"$D$128-(BS138+28)","v":{"$error":"#VALUE!"}},{"$error":"#VALUE!"},{"$f":"$D$128-(BU138+28)","v":{"$error":"#VALUE!"}},{"$f":"BN129/2","v":{"$error":"#VALUE!"}},null,null,null,null,null,null,null,null,null,null,null,null,null,null,null,{"$f":"IF(OR(CL117=\"\",CL136=\"\"),\"\",\"〇\")","v":""},{"$f":"IF(OR(CM117=\"\",CM136=\"\"),\"\",\"〇\")","v":""},"","","",null,null,{"$f":"IF(OR(CS117=\"\",CS136=\"\"),\"\",\"〇\")","v":""},"","","","",null,null,{"$f":"IF(OR(CZ117=\"\",CZ136=\"\"),\"\",\"〇\")","v":""},"","","","",null,null,{"$f":"IF(OR(DG117=\"\",DG136=\"\"),\"\",\"〇\")","v":""},"","","","",null,null,{"$f":"IF(OR(DN117=\"\",DN136=\"\"),\"\",\"〇\")","v":""},"","","",""]
[null,"STEP１ 設置場所の段差を入力してください",null,null,null,null,null,null,null,null,null,null,null,null,null,null,null,null,null,null,null,null,null,null,null,null,null,null,null,null,null,null,null,null,null,null,null,null,null,null,null,null,6,"(⑤÷２)-F",{"$f":"AS137/2-BQ132","v":{"$error":"#VALUE!"}},null,null,"【階段設置無し】必要数値",null,null,null,null,null,null,null,null,null,null,null,null,null,null,"⑪",{"$f":"BR143+AZ114","v":{"$error":"#VALUE!"}},"⑪",{"$f":"BR144+$AZ$122","v":{"$error":"#VALUE!"}},null,"Ａ下",{"$f":"$AX$130-((($AX$133-1)*$D$128)+BQ139)","v":{"$error":"#VALUE!"}},{"$f":"$AX$130-((($AX$133-1)*$D$128)+BR139)","v":{"$error":"#VALUE!"}},{"$f":"$AX$130-((($AX$133-1)*$D$128)+BS139)","v":{"$error":"#VALUE!"}},{"$f":"$AX$130-((($AX$133-1)*$D$128)+BT139)","v":{"$error":"#VALUE!"}},{"$f":"BN124/2","v":{"$error":"#VALUE!"}},{"$f":"$D$128-(BV137+28)","v":{"$error":"#VALUE!"}}]
[null,"(A)",null,"段差",null,null,null,null,null,null,null,"cm",null,{"$f":"IF(H139=\"\",\"0～72㎝まで\",IF(H139>72,\"設置不可です\",\"\"))","v":"0～72㎝まで"},null,null,null,null,null,null,null,null,null,null,null,null,null,null,null,null,null,null,null,null,null,null,null,null,null,null,null,null,"⑦","⑥＋採用F",{"$f":"AS138+BQ132","v":{"$error":"#VALUE!"}},null,null,null,"⑤","①","支柱間距離","ベースサイズ","連結バー角度",null,null,null,null,null,null,null,null,null,"⑩",{"$f":"BS143+AZ114","v":{"$error":"#VALUE!"}},"⑩",{"$f":"BS144+$AZ$122","v":{"$error":"#VALUE!"}},null,"Ｂ上",{"$f":"$D$128-(BQ140+28)","v":{"$error":"#VALUE!"}},{"$f":"BN126/2","v":{"$error":"#VALUE!"}},{"$f":"$D$128-(BS140+28)","v":{"$error":"#VALUE!"}},{"$f":"$D$128-(BT140+28)","v":{"$error":"#VALUE!"}},{"$f":"$AX$130-((($AX$133-1)*$D$128)+BU138)","v":{"$error":"#VALUE!"}},{"$f":"$AX$130-((($AX$133-1)*$D$128)+BV138)","v":{"$error":"#VALUE!"}}]
[null,null,null,null,null,null,null,null,null,null,null,null,null,null,null,null,null,null,null,null,null,null,null,null,null,null,null,null,null,null,null,null,null,null,null,null,null,null,null,null,null,null,null,null,null,null,null,"（A)",{"$f":"IF(ISBLANK(H143),\"\",VLOOKUP(H143,固定数値!E:F,2,0))","v":""},"―","―",null,"―",null,null,null,null,null,null,null,null,null,"⑦",{"$f":"BT143+AZ114","v":{"$error":"#VALUE!"}},"⑦",{"$f":"BT144+$AZ$122","v":{"$error":"#VALUE!"}},null,"Ｂ下",{"$f":"BN125/2","v":{"$error":"#VALUE!"}},{"$f":"$D$128-(BR139+28)","v":{"$error":"#VALUE!"}},{"$f":"$AY$130-((($AY$133-1)*$D$128)+BS141)","v":{"$error":"#VALUE!"}},{"$f":"$AY$130-((($AY$133-1)*$D$128)+BT141)","v":{"$error":"#VALUE!"}},{"$f":"$D$128-(BU139+28)","v":{"$error":"#VALUE!"}},{"$f":"$D$128-(BV139+28)","v":{"$error":"#VALUE!"}}]
[null,"STEP２ 設置したい製品を選択してください",null,null,null,null,null,null,null,null,null,null,null,null,null,null,null,null,null,null,null,null,null,null,null,null,null,null,null,null,null,null,null,null,null,null,null,null,null,null,null,null,null,"シングル",null,null,null,"（B)",null,{"$f":"IF(ISBLANK(H144),\"△\",IF(H144=\"600\",\"48.5\",IF(H144=\"900\",\"78.5\",IF(H144=\"1200\",\"108.5\",IF(H144=\"ウェーブS\",\"95.904\",IF(H144=\"ウェーブ\",\"123.084\",\"\"))))))","v":"△"},{"$f":"((AX141^2-$H139^2)^0.5)+(7.99*2)","v":{"$error":"#VALUE!"}},"―",{"$f":"ASIN(H139/AX141)","v":{"$error":"#VALUE!"}},null,{"$f":"IF(OR(H143=AR141,H143=AR143,H143=AR144,H143=AR146,H143=AR147,H143=AR148),AR141,\"\")","v":""},null,null,null,null,null,null,null,"⑫",{"$f":"BU143+AZ114","v":{"$error":"#VALUE!"}},"⑫",{"$f":"BU144+$AZ$122","v":{"$error":"#VALUE!"}},null,"Ｃ上",{"$f":"$AY$130-((($AY$133-1)*$D$128)+BQ140)","v":{"$error":"#VALUE!"}},{"$f":"$AY$130-((($AY$133-1)*$D$128)+BR140)","v":{"$error":"#VALUE!"}},{"$f":"$D$128-(BS142+28)","v":{"$error":"#VALUE!"}},{"$f":"BN128/2","v":{"$error":"#VALUE!"}},{"$f":"$AY$130-((($AY$133-1)*$D$128)+BU140)","v":{"$error":"#VALUE!"}},{"$f":"$AY$130-((($AY$133-1)*$D$128)+BV140)","v":{"$error":"#VALUE!"}}]
[null,null,null,null,null,null,null,null,null,null,null,null,null,null,null,null,null,null,null,null,null,null,null,null,null,null,null,null,null,null,null,null,null,null,null,null,null,null,null,null,null,null,null,"ダブル",null,null,null,"（C)",{"$f":"IF(ISBLANK(H145),\"\",VLOOKUP(H145,固定数値!E:F,2,0))","v":""},"―","―",null,"―",null,{"$f":"IF(OR(H143=AR142,H143=AR145),AR142,\"\")","v":""},null,"☆600 ","☆900 ","☆1200 ","☆ウェーブS ","☆ウェーブ ",null,"⑬",{"$f":"BV143+AZ114","v":{"$error":"#VALUE!"}},"⑬",{"$f":"BV144+$AZ$122","v":{"$error":"#VALUE!"}},null,"Ｃ下",{"$f":"$D$128-(BQ141+28)","v":{"$error":"#VALUE!"}},{"$f":"$D$128-(BR141+28)","v":{"$error":"#VALUE!"}},{"$f":"BN127/2","v":{"$error":"#VALUE!"}},{"$f":"$D$128-(BT141+28)","v":{"$error":"#VALUE!"}},{"$f":"$D$128-(BU141+28)","v":{"$error":"#VALUE!"}},{"$f":"$D$128-(BV141+28)","v":{"$error":"#VALUE!"}}]
[null,"(B)",null,"上段楽起",null,null,null,null,null,null,null,null,null,{"$f":"IF(H143=\"\",\"手すりを選択\",\"\")","v":"手すりを選択"},null,null,null,null,null,null,null,null,null,null,null,null,null,null,null,null,null,null,null,null,null,null,null,null,null,null,null,null,null,"ロング",null,null,null,null,null,null,1200,{"$f":"$I$150","v":"E"},null,null,{"$f":"IF(OR(H143=AR141,H143=AR143,H143=AR144,H143=AR146,H143=AR147,H143=AR148),AR143,\"\")","v":""},"段差",30,50,70,"35~55","47~72",null,null,null,null,null,null,"Ｘ",{"$f":"$AW$130-((($AW$133-1)*$D$128)+BQ137)","v":{"$error":"#VALUE!"}},{"$f":"$AW$130-((($AW$133-1)*$D$128)+BR137)","v":{"$error":"#VALUE!"}},{"$f":"$AW$130-((($AW$133-1)*$D$128)+BS137)","v":{"$error":"#VALUE!"}},{"$f":"$AW$130-((($AW$133-1)*$D$128)+BT137)","v":{"$error":"#VALUE!"}},{"$f":"$AW$130-((($AW$133-1)*$D$128)+BU137)","v":{"$error":"#VALUE!"}},{"$error":"#VALUE!"}]
[null,"(C)",null,"連結バー",null,null,null,null,null,null,null,null,null,{"$f":"IF(H139=\"\",\"ナシ\",BE144&BF144&BG144&BH144&BI144)","v":"ナシ"},null,null,null,null,null,null,null,null,null,null,null,null,null,null,null,null,null,null,null,null,null,null,null,null,null,null,null,null,null,"ショート",null,null,null,null,null,null,900,{"$f":"$I$150","v":"E"},null,null,{"$f":"IF(OR(H143=AR141,H143=AR143,H143=AR146,H143=AR147,H143=AR148),AR144,\"\")","v":""},"連結１",{"$f":"IF($H$139=\"\",\"\",IF($H$139<=BE143,BE142,\"\"))","v":""},{"$f":"IF($H$139=\"\",\"\",IF($H$139<=BF143,BF142,\"\"))","v":""},{"$f":"IF($H$139=\"\",\"\",IF($H$139<=BG143,BG142,\"\"))","v":""},{"$f":"IF($H$139=\"\",\"\",IF(AND($H$139<=55,$H$139>=35),BH142,\"\"))","v":""},{"$f":"IF($H$139=\"\",\"\",IF(AND($H$139<=72,$H$139>=47),BI142,\"\"))","v":""},"ﾌﾟﾙﾀﾞｳﾝﾘｽﾄ",{"$f":"IF(BE144=\"\",\"\",\"600\")","v":""},{"$f":"IF(BF144=\"\",\"\",\"900\")","v":""},{"$f":"IF(BG144=\"\",\"\",\"1200\")","v":""},{"$f":"IF(BH144=\"\",\"\",\"ウェーブS\")","v":""},{"$f":"IF(BI144=\"\",\"\",\"ウェーブ\")","v":""},"Ｙ",{"$f":"$AZ$130-((($AZ$133-1)*$D$128)+BQ142)","v":{"$error":"#VALUE!"}},{"$f":"$AZ$130-((($AZ$133-1)*$D$128)+BR142)","v":{"$error":"#VALUE!"}},{"$f":"$AZ$130-((($AZ$133-1)*$D$128)+BS142)","v":{"$error":"#VALUE!"}},{"$error":"#VALUE!"},{"$f":"$AZ$130-((($AZ$133-1)*$D$128)+BU142)","v":{"$error":"#VALUE!"}},{"$error":"#VALUE!"}]
[null,"(D)",null,"下段楽起",null,null,null,null,null,null,null,null,null,{"$f":"IF(H145=\"\",\"手すりを選択\",IF(AND(H143=\"ショートダブル\",AW150=\"S\"),\"ダブルに変更\",IF(AND(H143=\"ショートダブル\",AZ150=\"\"),\"ダブルに変更\",IF(AND(H143=\"ショート\",H145=\"ショートダブル\"),\"片手すり(大ベース)に変更\",IF(AX150=2,\"大ベースの手すりに変更\",IF(AND(AY150=\"D\",BA150=1),\"両手すりに変更\",\"\"))))))","v":"手すりを選択"},null,null,null,null,null,null,null,null,null,null,null,null,null,null,null,null,null,null,null,null,null,null,null,null,null,null,null,null,null,"ショートダブル",null,null,null,"角度チェック",{"$f":"IF(I151=\"\",\"△\",COUNTIFS(I151,\">=\"&-7.014,I151,\"<=\"&7.014))","v":"△"},null,600,{"$f":"$I$150","v":"E"},null,null,{"$f":"IF(H143=AR142,AR145,\"\")","v":""},null,null,null,null,null,null,null,null,null,null,null,null,null,null,null,null,null,null,null,null,"仮連②",null,{"$f":"BJ115","v":""},{"$f":"BK115","v":""},{"$f":"BL115","v":""},{"$f":"BM115","v":""},{"$f":"BN115","v":""},null,null,"①イウベ距離","②イウ総距離","③イウ段数","④イウ総踏面","⑤\n④-②","⑥\n(⑤/２)-F","イ）\n段数","イ）\nベ距離","ウ）\nベ距離","ア）\n段数","エ）\n段数","ア）\nベ距離","仮連①"]
[null,null,null,null,null,null,null,null,null,null,null,null,null,{"$f":"IF(H144=\"\",\"〇\",IF(COUNTIF(BK144:BO144,H144)=0,\"×\",\"〇\"))","v":"〇"},{"$f":"IF(N144=\"ナシ\",\"×\",\"〇\")","v":"×"},{"$f":"IF(OR(N145=\"\",N145=\"手すりを選択\"),\"〇\",\"×\")","v":"〇"},null,null,null,null,null,null,null,null,null,null,null,null,null,null,null,null,null,null,null,null,null,null,null,null,null,null,null,"横型",null,null,null,"F40°以上×",{"$f":"IF(I150<=40.2,\"〇\",\"×\")","v":"×"},null,"ウェーブ",29.22,null,null,{"$f":"IF(OR(H143=AR143,H143=AR141,H143=AR146,H143=AR148,H143=AR147),AR149,\"\")","v":""},null,null,null,null,null,null,null,null,null,null,null,null,null,null,null,null,null,null,null,null,{"$f":"LOOKUP(BY146,BZ146:CD146,BZ145:CD145)","v":{"$error":"#N/A"}},{"$f":"MAX(BZ146:CD146)","v":0},{"$f":"IF(BZ145=\"\",\"\",BI121)","v":""},{"$f":"IF(CA145=\"\",\"\",BL121)","v":""},{"$f":"IF(CB145=\"\",\"\",BJ121)","v":""},{"$f":"IF(CC145=\"\",\"\",BK121)","v":""},{"$f":"IF(CD145=\"\",\"\",BM121)","v":""},null,null,{"$f":"CN146+CO146+28","v":{"$error":"#VALUE!"}},{"$f":"CG146+56","v":{"$error":"#VALUE!"}},{"$f":"CM146+BQ130","v":{"$error":"#VALUE!"}},{"$f":"(CI146+1)*D128","v":{"$error":"#VALUE!"}},{"$f":"CJ146-CH146","v":{"$error":"#VALUE!"}},{"$f":"(CK146/2)-CA118","v":{"$error":"#VALUE!"}},{"$f":"IF(BY146=CD115,CD119,IF(BY146=CE115,CE119,IF(BY146=CF115,CF119,IF(BY146=CG115,CG119,IF(BY146=CH115,CH119,\"\")))))","v":""},{"$f":"IF(BY146=CD115,CD117,IF(BY146=CE115,CE117,IF(BY146=CF115,CF117,IF(BY146=CG115,CG117,IF(BY146=CH115,CH117,\"\")))))","v":""},{"$f":"IF(BY149=CD115,CL115,IF(BY149=CE115,CM115,IF(BY149=CF115,CN115,IF(BY149=CG115,CO115,IF(BY149=CH115,CP115,\"\")))))","v":""},{"$f":"IF(BY146=CD115,CT99,IF(BY146=CE115,CT100,IF(BY146=CF115,CT101,IF(BY146=CG115,CT102,IF(BY146=CH115,CT103,\"\")))))","v":""},{"$f":"D126-(CP146+CM146+BQ130)","v":{"$error":"#VALUE!"}},{"$f":"INDEX(DO99:DS103, MATCH(BY146,DN99:DN103,0), MATCH(CS146,DO98:DS98,0))","v":{"$error":"#N/A"}},{"$f":"MAX(CW105:DF105)","v":0}]
[null,"完了です。設置判定をご確認ください",null,null,null,null,null,null,null,null,null,null,null,null,null,null,null,null,null,null,null,null,null,null,null,null,null,null,null,null,null,null,null,null,null,null,null,null,null,null,null,null,null,"縦型",null,null,null,"G-6～6°",{"$f":"IFERROR(IF(OR(AW145=1,AW145=\"△\"),\"〇\",\"×\"),\"\")","v":"〇"},null,"ウェーブS",27.98,null,null,{"$f":"IF(OR(H143=AR141,H143=AR143,H143=AR144,H143=AR146,H143=AR147,H143=AR148),AR146,\"\")","v":""},null,null,null,null,null,null,null,null,null,null,null,null,null,null,null,null,null,null,null,null,null,null,null,null,null,null,null,null,null,null,null,null,null,null,"⑦"]
[null,"設置判定",null,null,null,null,null,null,{"$f":"IF(OR(H139=\"\",H143=\"\",H144=\"\",H145=\"\"),\"\",IF(AND(N146=\"×\",O146=\"〇\"),\"△\",IF(AND(P146=\"×\",O146=\"〇\"),\"△\",IF(COUNTIFS(AW146:AW147,\"*×*\")>0,\"×\",IF(AX150=2,\"×\",IF(AND(AY150=\"D\",AZ150=\"\"),\"×\",\"〇\"))))))","v":""},null,null,null,null,null,null,null,null,null,null,null,null,null,null,null,null,null,null,null,null,null,null,null,null,null,null,null,null,null,null,null,null,null,null,"ワイド縦型",null,null,null,null,null,null,null,null,null,null,{"$f":"IF(OR(H143=AR141,H143=AR143,H143=AR144,H143=AR146,H143=AR147,H143=AR148),AR147,\"\")","v":""},null,null,null,null,null,null,null,null,null,null,null,null,null,null,null,null,null,null,null,null,"仮連③",null,600,900,1200,"ウェーブS","ウェーブ",null,"ア）最低\nべ距離",null,{"$f":"CL148+((CP146-1)*$D$128)","v":{"$error":"#VALUE!"}},null,null,null,{"$f":"CL146+CA118","v":{"$error":"#VALUE!"}}]
[null,"(E)",null,"ベース間の距離",null,null,null,null,{"$f":"IFERROR(AY141-(AW140+AW142),\"E\")","v":"E"},null,null,"cm",null,null,null,null,null,null,null,null,null,null,null,null,null,null,null,null,null,null,null,null,null,null,null,null,null,null,null,null,null,null,null,"スリム",null,null,null,"ショート判定",null,null,"ダブル判定",null,null,null,{"$f":"IF(OR(H143=AR141,H143=AR143,H143=AR144,H143=AR146,H143=AR147,H143=AR148),AR150,\"\")","v":""},null,null,null,null,null,null,null,null,null,null,null,null,null,null,null,null,null,null,null,null,{"$f":"LOOKUP(BY149,BZ150:CD152,BZ148:CD148)","v":{"$error":"#N/A"}},{"$f":"MAX(BZ150:CD152)","v":0},{"$f":"IF($BY$146=108.5,CS117,IF($BY$146=48.5,CL117,IF($BY$146=95.9,CZ117,IF($BY$146=78.5,DG117,IF($BY$146=123.1,DN117,\"\")))))","v":""},{"$f":"IF($BY$146=108.5,CV117,IF($BY$146=48.5,CO117,IF($BY$146=95.9,DC117,IF($BY$146=78.5,DJ117,IF($BY$146=123.1,DQ117,\"\")))))","v":""},{"$f":"IF($BY$146=108.5,CT117,IF($BY$146=48.5,CM117,IF($BY$146=95.9,DA117,IF($BY$146=78.5,DH117,IF($BY$146=123.1,DO117,\"\")))))","v":""},{"$f":"IF($BY$146=108.5,CU117,IF($BY$146=48.5,CN117,IF($BY$146=95.9,DB117,IF($BY$146=78.5,DI117,IF($BY$146=123.1,DP117,\"\")))))","v":""},{"$f":"IF($BY$146=108.5,CW117,IF($BY$146=48.5,CP117,IF($BY$146=95.9,DD117,IF($BY$146=78.5,DK117,IF($BY$146=123.1,DR117,\"\")))))","v":""},null,"エ）最低\nベ距離",null,{"$f":"CL148+((CQ146-1)*$D$128)","v":{"$error":"#VALUE!"}}]
[null,"(F)",null,"連結バーの角度",null,null,null,null,{"$f":"IFERROR(BA141*180/PI(),\"E\")","v":"E"},null,null,"°",null,null,null,null,null,null,null,null,null,null,null,null,null,null,null,null,null,null,null,null,null,null,null,null,null,null,null,null,null,null,null,"介助バー型",null,null,null,{"$f":"IF(OR(H143=\"ショート\",H143=\"ショートダブル\"),\"S\",\"\")","v":""},{"$f":"IF(OR(H145=\"ショート\",H145=\"ショートダブル\",H145=\"スリム\",H145=\"狭所用波型\"),\"S\",\"\")","v":""},{"$f":"COUNTIFS(AV150:AW150,\"S\")","v":0},{"$f":"IF(OR(H143=\"ダブル\",H143=\"ショートダブル\"),\"D\",\"\")","v":""},{"$f":"IF(OR(H145=\"ダブル\",H145=\"ショートダブル\"),\"D\",\"\")","v":""},{"$f":"COUNTIFS(AY150:AZ150,\"D\")","v":0},null,{"$f":"IF(OR(H143=AR141,H143=AR143,H143=AR144,H143=AR146,H143=AR147,H143=AR148),AR148,\"\")","v":""},null,null,null,null,null,null,null,null,null,null,null,null,null,null,null,null,null,null,null,null,null,null,{"$f":"IF(BZ149=\"\",\"\",BI121)","v":""},{"$f":"IF(CA149=\"\",\"\",BL121)","v":""},{"$f":"IF(CB149=\"\",\"\",BJ121)","v":""},{"$f":"IF(CC149=\"\",\"\",BK121)","v":""},{"$f":"IF(CD149=\"\",\"\",BM121)","v":""}]
[null,"(G)",null,"水平部分の角度",null,null,null,null,{"$f":"IFERROR(IF(H144=\"ウェーブ\",I150-29.22,IF(H144=\"ウェーブS\",I150-27.98,\"\")),\"E\")","v":""},null,null,"°",null,null,null,null,null,null,null,null,null,null,null,null,null,null,null,null,null,null,null,null,null,null,null,null,null,null,null,null,null,null,null,"ワイド介助バー型",null,null,null,null,null,null,null,null,null,null,{"$f":"IF(OR(H143=AR141,H143=AR143,H143=AR144,H143=AR146,H143=AR147,H143=AR148),AR151,\"\")","v":""}]
[null,null,null,null,null,null,null,null,null,null,null,null,null,null,null,null,null,null,null,null,null,null,null,null,null,null,null,null,null,null,null,null,null,null,null,null,null,null,null,null,null,null,null,"波型",null,null,null,null,null,null,null,null,null,null,{"$f":"IF(OR(H143=AR141,H143=AR143,H143=AR144,H143=AR146,H143=AR147,H143=AR148),AR152,\"\")","v":""}]
[null,"【組合わせに必要なTAISコード】",null,null,null,null,null,null,null,null,null,null,null,null,null,null,null,null,null,null,null,null,null,null,null,null,null,null,null,null,null,null,null,null,null,null,null,null,null,null,null,null,null,"狭所用波型",null,null,null,null,null,null,null,null,null,null,{"$f":"IF(OR(H143=AR141,H143=AR143,H143=AR146,H143=AR147,H143=AR148),AR153,\"\")","v":""}]
[null,{"$f":"IFERROR(IF(OR(I148=\"×\",I148=\"\",I148=\"△\"),\"\",IF(H145=\"スリム\",INDEX(TAISﾘｽﾄ!H3:L19,MATCH(H143,TAISﾘｽﾄ!A3:A19,0),MATCH(H144,TAISﾘｽﾄ!H2:L2,0)),INDEX(TAISﾘｽﾄ!B3:L19,MATCH(H143,TAISﾘｽﾄ!A3:A19,0),MATCH(H144,TAISﾘｽﾄ!B2:L2,0)))),\"\")","v":""},null,null,null,null,null,null,{"$f":"IF(OR(I148=\"\",I148=\"×\",I148=\"△\"),\"\",IF(H145=\"スリム\",H143&\"+スリム+連結バー\"&H144&\"セット\",IF(H143=\"ダブル\",H143&\"＋連結バー\"&H144&\" 2本セット\",IF(H143=\"ショートダブル\",H143&\"＋連結バー\"&H144&\" 2本セット\",H143&\"+連結バー\"&H144&\" セット\"))))","v":""}]
[null,{"$f":"IFERROR(IF(OR(I148=\"×\",I148=\"\",I148=\"△\"),\"\",IF(H145=\"スリム\",\"\",INDEX(TAISﾘｽﾄ!B3:B19,MATCH(H145,TAISﾘｽﾄ!A3:A19,0)))),\"\")","v":""},null,null,null,null,null,null,{"$f":"IF(OR(I148=\"\",I148=\"×\",I148=\"△\"),\"\",IF(H145=\"スリム\",\"\",H145))","v":""}]

{"sheet":"TAISﾘｽﾄ","index":1,"n_rows":19,"n_cols":12,"rows_kept":19,"cut":false,"hidden":true,"merged":[[0,7,0,11],[0,2,0,6]]}
[null,null,"連結バーセット",null,null,null,null,"スリムセット"]
[null,"単体","600","900","1200","ウェーブS","ウェーブ","600","900","1200","ウェーブS","ウェーブ"]
["シングル","01339-000034","01339-000042","01339-000043","01339-000044","01339-000125","01339-000045","01339-000046","01339-000047","01339-000048","01339-000126","01339-000049"]
["ダブル","01339-000035","01339-000050","01339-000051","01339-000052","01339-000127","01339-000053","×","×","×","×","×"]
["ロング","01339-000036","01339-000054","01339-000055","01339-000056","01339-000128","01339-000057","01339-000058","01339-000059","01339-000060","01339-000129","01339-000061"]
["ショート","01339-000119","01339-000120","01339-000121","01339-000122","01339-000142","01339-000123","×","×","×","×","×"]
["ショートダブル","01339-000143","01339-000144","01339-000145","01339-000146","01339-000147","01339-000148","×","×","×","×","×"]
["横型","01339-000006","01339-000062","01339-000063","01339-000064","01339-000130","01339-000065","01339-000066","01339-000067","01339-000068","01339-000131","01339-000069"]
["縦型","01339-000007","01339-000081","01339-000082","01339-000083","01339-000134","01339-000084","01339-000085","01339-000086","01339-000087","01339-000135","01339-000088"]
["介助バー型","01339-000005","×","×","×","×","×","×","×","×","×","×"]
["ワイド縦型","01339-000013","01339-000100","01339-000101","01339-000102","01339-000138","01339-000103","01339-000104","01339-000105","01339-000106","01339-000139","01339-000107"]
["ワイド介助バー型","01339-000011","×","×","×","×","×","×","×","×","×","×"]
["波型","01339-000029","×","×","×","×","×","×","×","×","×","×"]
["狭所用波型","01339-000020","×","×","×","×","×","×","×","×","×","×"]
["600","01339-000038","×","×","×","×","×","×","×","×","×","×"]
["900","01339-000039","×","×","×","×","×","×","×","×","×","×"]
["1200","01339-000040","×","×","×","×","×","×","×","×","×","×"]
["ウェーブS","01339-000124","×","×","×","×","×","×","×","×","×","×"]
["ウェーブ","01339-000041","×","×","×","×","×","×","×","×","×","×"]

{"sheet":"S+Sﾁｪｯｸ表","index":2,"n_rows":136,"n_cols":33,"rows_kept":136,"cut":false,"hidden":true,"merged":[[111,3,111,32],[113,1,135,1],[111,1,112,2],[2,2,2,14],[29,2,29,14],[30,1,31,2],[57,1,58,2],[5,1,27,1],[3,3,3,32],[30,3,30,32],[32,1,54,1],[57,3,57,32],[59,1,81,1],[0,1,0,17],[84,1,85,2],[110,2,110,14],[56,2,56,14],[83,2,83,14],[83,15,83,21],[110,15,110,21],[84,3,84,32],[86,1,108,1]]}
[null,"【階上でのショート同士の連結チェック表】"]
[]
[null,"製品","連結バー６００"]
[null,null,null,"蹴上"]
[null,null,null,1,2,3,4,5,6,7,8,9,10,11,12,13,14,15,16,17,18,19,20,21,22,23,24,25,26,27,28,29,30]
[null,"踏面",28,"×","×","×","×","×","×","×","×","×","×","×","×","×","×","×","×","×","×","×","×","×","×","×","×","×","×","×","×","×","×"]
[null,null,29,"×","×","×","×","×","×","×","×","×","×","×","×","×","×","×","×","×","×","×","×","×","×","×","×","×","×","×","×","×","×"]
[null,null,30,"×","×","×","×","×","×","×","×","×","×","×","×","×","×","×","×","×","×","×","×","×","×","×","×","×","×","×","×","×","×"]
[null,null,31,"×","×","×","×","×","×","×","×","×","×","×","×","×","×","×","×","×","×","×","×","×","×","×","×","×","×","×","×","×","×"]
[null,null,32,"×","×","×","×","×","×","×","×","×","×","×","×","×","×",1,"×","×","×","×","×","×","×","×","×","×","×","×","×","×","×"]
[null,null,33,"×","×","×","×","×","×","×","×","×","×","×","×",1,1,1,"×","×","×","×","×","×","×","×","×","×","×","×","×","×","×"]
[null,null,34,"×","×","×","×","×","×","×","×",1,1,1,1,1,1,1,"×","×","×","×","×","×","×","×","×","×","×","×","×","×","×"]
[null,null,35,"×","×","×",1,1,1,1,1,1,1,1,1,1,1,1,"×","×","×","×","×","×","×","×","×","×","×","×","×","×","×"]
[null,null,36,1,1,1,1,1,1,1,1,1,1,1,1,1,1,1,"×","×","×","×","×","×","×","×","×","×","×","×","×","×","×"]
[null,null,37,1,1,1,1,1,1,1,1,1,1,1,1,1,1,1,"×","×","×","×","×","×","×","×","×","×","×","×","×","×","×"]
[null,null,38,1,1,1,1,1,1,1,1,1,1,1,1,1,1,1,"×","×","×","×","×","×","×","×","×","×","×","×","×","×","×"]
[null,null,39,1,1,1,1,1,1,1,1,1,1,1,1,1,1,1,"×","×","×","×","×","×","×","×","×","×","×","×","×","×","×"]
[null,null,40,1,1,1,1,1,1,1,1,1,1,1,1,1,1,"×","×","×","×","×","×","×","×","×","×","×","×","×","×","×","×"]
[null,null,41,1,1,1,1,1,1,1,1,1,1,1,1,1,"×","×","×","×","×","×","×","×","×","×","×","×","×","×","×","×","×"]
[null,null,42,1,1,1,1,1,1,1,1,1,1,1,1,"×","×","×","×","×","×","×","×","×","×","×","×","×","×","×","×","×","×"]
[null,null,43,1,1,1,1,1,1,1,1,1,1,1,1,"×","×","×","×","×","×","×","×","×","×","×","×","×","×","×","×","×","×"]
[null,null,44,1,1,1,1,1,1,1,1,1,1,1,"×","×","×","×","×","×","×","×","×","×","×","×","×","×","×","×","×","×","×"]
[null,null,45,1,1,1,1,1,1,1,1,1,1,"×","×","×","×","×","×","×","×","×","×","×","×","×","×","×","×","×","×","×","×"]
[null,null,46,1,1,1,1,1,1,1,1,1,"×","×","×","×","×","×","×","×","×","×","×","×","×","×","×","×","×","×","×","×","×"]
[null,null,47,1,1,1,1,1,1,1,"×","×","×","×","×","×","×","×","×","×","×","×","×","×","×","×","×","×","×","×","×","×","×"]
[null,null,48,1,1,1,1,1,1,"×","×","×","×","×","×","×","×","×","×","×","×","×","×","×","×","×","×","×","×","×","×","×","×"]
[null,null,49,1,1,1,"×","×","×","×","×","×","×","×","×","×","×","×","×","×","×","×","×","×","×","×","×","×","×","×","×","×","×"]
[null,null,50,"×","×","×","×","×","×","×","×","×","×","×","×","×","×","×","×","×","×","×","×","×","×","×","×","×","×","×","×","×","×"]
[]
[null,"製品","連結バー９００"]
[null,null,null,"蹴上"]
[null,null,null,1,2,3,4,5,6,7,8,9,10,11,12,13,14,15,16,17,18,19,20,21,22,23,24,25,26,27,28,29,30]
[null,"踏面",28,"×","×","×","×","×","×","×","×","×","×","×","×","×","×","×","×","×","×","×","×","×","×","×","×","×","×","×","×","×","×"]
[null,null,29,"×","×","×","×","×","×","×","×","×","×","×","×","×","×","×","×","×","×","×","×","×","×","×","×","×","×","×","×","×","×"]
[null,null,30,"×","×","×","×","×","×","×","×","×","×","×","×","×","×","×",2,"×","×","×","×","×","×","×","×","×","×","×","×","×","×"]
[null,null,31,"×","×","×","×","×","×","×","×","×","×","×","×","×",2,2,2,"×","×","×","×","×","×","×","×","×","×","×","×","×","×"]
[null,null,32,"×","×","×","×","×","×","×","×","×","×","×",2,2,2,2,"×","×","×","×","×","×","×","×","×","×","×","×","×","×","×"]
[null,null,33,"×","×","×","×","×","×","×",2,2,2,2,2,2,2,"×","×","×","×","×","×","×","×","×","×","×","×","×","×","×","×"]
[null,null,34,2,2,2,2,2,2,2,2,2,2,2,2,2,"×","×","×","×","×","×","×","×","×","×","×","×","×","×","×","×","×"]
[null,null,35,2,2,2,2,2,2,2,2,2,2,2,2,"×","×","×","×","×","×","×","×","×","×","×","×","×","×","×","×","×","×"]
[null,null,36,2,2,2,2,2,2,2,2,2,2,2,"×","×","×","×","×","×","×","×","×","×","×","×","×","×","×","×","×","×","×"]
[null,null,37,2,2,2,2,2,2,2,2,2,"×","×","×","×","×","×","×","×","×","×","×","×","×","×","×","×","×","×","×","×","×"]
[null,null,38,2,2,2,2,2,2,2,"×","×","×","×","×","×","×","×","×","×","×","×","×","×","×","×","×","×","×","×","×","×","×"]
[null,null,39,2,2,2,2,2,"×","×","×","×","×","×","×","×","×","×","×","×","×","×","×","×","×","×","×","×","×","×","×","×","×"]
[null,null,40,"×","×","×","×","×","×","×","×","×","×","×","×","×","×","×","×","×","×","×","×","×","×","×",1,1,"×","×","×","×","×"]
[null,null,41,"×","×","×","×","×","×","×","×","×","×","×","×","×","×","×","×","×","×","×","×","×",1,1,1,1,"×","×","×","×","×"]
[null,null,42,"×","×","×","×","×","×","×","×","×","×","×","×","×","×","×","×","×","×",1,1,1,1,1,1,1,"×","×","×","×","×"]
[null,null,43,"×","×","×","×","×","×","×","×","×","×","×","×","×","×","×",1,1,1,1,1,1,1,1,1,1,"×","×","×","×","×"]
[null,null,44,"×","×","×","×","×","×","×","×","×","×","×",1,1,1,1,1,1,1,1,1,1,1,1,1,1,"×","×","×","×","×"]
[null,null,45,"×","×","×","×",1,1,1,1,1,1,1,1,1,1,1,1,1,1,1,1,1,1,1,1,1,"×","×","×","×","×"]
[null,null,46,1,1,1,1,1,1,1,1,1,1,1,1,1,1,1,1,1,1,1,1,1,1,1,1,1,"×","×","×","×","×"]
[null,null,47,1,1,1,1,1,1,1,1,1,1,1,1,1,1,1,1,1,1,1,1,1,1,1,1,1,"×","×","×","×","×"]
[null,null,48,1,1,1,1,1,1,1,1,1,1,1,1,1,1,1,1,1,1,1,1,1,1,1,1,1,"×","×","×","×","×"]
[null,null,49,1,1,1,1,1,1,1,1,1,1,1,1,1,1,1,1,1,1,1,1,1,1,1,1,1,"×","×","×","×","×"]
[null,null,50,1,1,1,1,1,1,1,1,1,1,1,1,1,1,1,1,1,1,1,1,1,1,1,1,1,"×","×","×","×","×"]
[]
[null,"製品","連結バー１２００"]
[null,null,null,"蹴上"]
[null,null,null,1,2,3,4,5,6,7,8,9,10,11,12,13,14,15,16,17,18,19,20,21,22,23,24,25,26,27,28,29,30]
[null,"踏面",28,"×","×","×","×","×","×","×","×","×","×","×","×","×","×","×","×","×","×","×","×","×","×","×","×","×","×","×","×","×","×"]
[null,null,29,"×","×","×","×","×","×","×","×","×","×","×","×","×","×","×",3,"×","×","×","×","×","×","×","×","×","×","×","×","×","×"]
[null,null,30,"×","×","×","×","×","×","×","×","×","×","×","×","×",3,3,"×","×","×","×","×","×","×","×","×","×","×","×","×","×","×"]
[null,null,31,"×","×","×","×","×","×","×","×","×","×","×",3,3,3,"×","×","×","×","×","×","×","×","×","×","×","×","×","×","×","×"]
[null,null,32,"×","×","×","×","×","×","×","×",3,3,3,3,3,"×","×","×","×","×","×","×","×","×","×","×","×","×","×","×","×","×"]
[null,null,33,"×","×",3,3,3,3,3,3,3,3,3,3,"×","×","×","×","×","×","×","×","×","×","×","×","×","×","×","×","×","×"]
[null,null,34,3,3,3,3,3,3,3,3,3,"×","×","×","×","×","×","×","×","×","×","×","×","×","×","×","×","×","×","×","×","×"]
[null,null,35,3,3,3,3,3,3,3,"×","×","×","×","×","×","×","×","×","×","×","×","×","×","×","×","×","×","×","×","×","×","×"]
[null,null,36,3,3,3,3,"×","×","×","×","×","×","×","×","×","×","×","×","×","×","×","×","×",2,2,"×","×","×","×","×","×","×"]
[null,null,37,"×","×","×","×","×","×","×","×","×","×","×","×","×","×","×","×","×","×","×",2,2,2,2,"×","×","×","×","×","×","×"]
[null,null,38,"×","×","×","×","×","×","×","×","×","×","×","×","×","×","×","×","×",2,2,2,2,2,2,"×","×","×","×","×","×","×"]
[null,null,39,"×","×","×","×","×","×","×","×","×","×","×","×","×","×",2,2,2,2,2,2,2,2,2,"×","×","×","×","×","×","×"]
[null,null,40,"×","×","×","×","×","×","×","×","×","×","×",2,2,2,2,2,2,2,2,2,2,2,2,"×","×","×","×","×","×","×"]
[null,null,41,"×","×","×","×","×",2,2,2,2,2,2,2,2,2,2,2,2,2,2,2,2,2,2,"×","×","×","×","×","×","×"]
[null,null,42,2,2,2,2,2,2,2,2,2,2,2,2,2,2,2,2,2,2,2,2,2,2,2,"×","×","×","×","×","×","×"]
[null,null,43,2,2,2,2,2,2,2,2,2,2,2,2,2,2,2,2,2,2,2,2,2,2,"×","×","×","×","×","×","×","×"]
[null,null,44,2,2,2,2,2,2,2,2,2,2,2,2,2,2,2,2,2,2,2,2,2,"×","×","×","×","×","×","×","×","×"]
[null,null,45,2,2,2,2,2,2,2,2,2,2,2,2,2,2,2,2,2,2,2,2,"×","×","×","×","×","×","×","×","×","×"]
[null,null,46,2,2,2,2,2,2,2,2,2,2,2,2,2,2,2,2,2,2,2,"×","×","×","×","×","×","×","×","×","×","×"]
[null,null,47,2,2,2,2,2,2,2,2,2,2,2,2,2,2,2,2,2,2,"×","×","×","×","×","×","×","×","×","×","×","×"]
[null,null,48,2,2,2,2,2,2,2,2,2,2,2,2,2,2,2,2,2,"×","×","×","×","×","×","×","×","×","×","×","×","×"]
[null,null,49,2,2,2,2,2,2,2,2,2,2,2,2,2,2,2,2,"×","×","×","×","×","×","×","×","×","×","×","×","×","×"]
[null,null,50,2,2,2,2,2,2,2,2,2,2,2,2,2,2,"×","×","×","×","×","×","×","×","×","×","×","×","×",1,1,1]
[]
[null,"製品","連結バーウェーブS",null,null,null,null,null,null,null,null,null,null,null,null,"対応段差：35～55（水平角度7.05°）"]
[null,null,null,"蹴上"]
[null,null,null,1,2,3,4,5,6,7,8,9,10,11,12,13,14,15,16,17,18,19,20,21,22,23,24,25,26,27,28,29,30]
[null,"踏面",28,"×","×","×","×","×","×","×","×","×","×","×",3,"×","×","×","×","×","×","×","×","×","×","×","×","×","×","×","×","×","×"]
[null,null,29,"×","×","×","×","×","×","×","×","×",3,"×","×","×","×","×","×","×","×","×","×","×","×","×","×","×","×","×","×","×","×"]
[null,null,30,"×","×","×","×","×","×","×","×","×","×","×","×","×","×","×","×","×","×","×","×","×","×","×","×","×","×","×","×","×","×"]
[null,null,31,"×","×","×","×","×","×","×","×","×","×","×","×","×","×","×","×","×","×","×","×","×","×","×","×","×","×","×","×","×","×"]
[null,null,32,"×","×","×","×","×","×","×","×","×","×","×","×","×","×","×","×","×","×","×","×","×","×","×","×","×","×","×","×","×","×"]
[null,null,33,"×","×","×","×","×","×","×","×","×","×","×","×","×","×","×","×","×","×","×","×","×","×","×","×","×","×","×","×","×","×"]
[null,null,34,"×","×","×","×","×","×","×","×","×","×","×","×","×","×","×","×","×","×","×","×","×","×","×","×","×","×","×","×","×","×"]
[null,null,35,"×","×","×","×","×","×","×","×","×","×","×","×","×","×","×",2,2,2,"×","×","×","×","×","×","×","×","×","×","×","×"]
[null,null,36,"×","×","×","×","×","×","×","×","×","×","×","×","×",2,2,2,2,2,"×","×","×","×","×","×","×","×","×","×","×","×"]
[null,null,37,"×","×","×","×","×","×","×","×","×","×","×",2,2,2,2,2,2,2,"×","×","×","×","×","×","×","×","×","×","×","×"]
[null,null,38,"×","×","×","×","×","×","×","×","×","×","×",2,2,2,2,2,2,2,"×","×","×","×","×","×","×","×","×","×","×","×"]
[null,null,39,"×","×","×","×","×","×","×","×","×","×","×",2,2,2,2,2,2,2,"×","×","×","×","×","×","×","×","×","×","×","×"]
[null,null,40,"×","×","×","×","×","×","×","×","×","×","×",2,2,2,2,2,2,2,"×","×","×","×","×","×","×","×","×","×","×","×"]
[null,null,41,"×","×","×","×","×","×","×","×","×","×","×",2,2,2,2,2,2,"×","×","×","×","×","×","×","×","×","×","×","×","×"]
[null,null,42,"×","×","×","×","×","×","×","×","×","×","×",2,2,2,2,2,"×","×","×","×","×","×","×","×","×","×","×","×","×","×"]
[null,null,43,"×","×","×","×","×","×","×","×","×","×","×",2,2,2,"×","×","×","×","×","×","×","×","×","×","×","×","×","×","×","×"]
[null,null,44,"×","×","×","×","×","×","×","×","×","×","×",2,2,"×","×","×","×","×","×","×","×","×","×","×","×","×","×","×","×","×"]
[null,null,45,"×","×","×","×","×","×","×","×","×","×","×","×","×","×","×","×","×","×","×","×","×","×","×","×","×","×","×","×","×","×"]
[null,null,46,"×","×","×","×","×","×","×","×","×","×","×","×","×","×","×","×","×","×","×","×","×","×","×","×","×",1,1,"×","×","×"]
[null,null,47,"×","×","×","×","×","×","×","×","×","×","×","×","×","×","×","×","×","×","×","×","×","×","×",1,1,1,1,"×","×","×"]
[null,null,48,"×","×","×","×","×","×","×","×","×","×","×","×","×","×","×","×","×","×","×","×",1,1,1,1,1,1,1,"×","×","×"]
[null,null,49,"×","×","×","×","×","×","×","×","×","×","×","×","×","×","×","×","×",1,1,1,1,1,1,1,1,1,1,"×","×","×"]
[null,null,50,"×","×","×","×","×","×","×","×","×","×","×","×","×","×","×","×","×",1,1,1,1,1,1,1,1,1,1,"×","×","×"]
[]
[null,"製品","連結バーウェーブ",null,null,null,null,null,null,null,null,null,null,null,null,"対応段差：47～72（水平角度7.05°）"]
[null,null,null,"蹴上"]
[null,null,null,1,2,3,4,5,6,7,8,9,10,11,12,13,14,15,16,17,18,19,20,21,22,23,24,25,26,27,28,29,30]
[null,"踏面",28,"×","×","×","×","×","×","×","×","×","×","×","×","×","×","×","×","×","×","×","×","×","×","×","×","×","×","×","×","×","×"]
[null,null,29,"×","×","×","×","×","×","×","×","×","×","×","×","×","×","×","×","×","×","×","×","×","×","×","×","×","×","×","×","×","×"]
[null,null,30,"×","×","×","×","×","×","×","×","×","×","×","×","×","×","×","×","×","×","×","×","×","×","×","×","×","×","×","×","×","×"]
[null,null,31,"×","×","×","×","×","×","×","×","×","×","×","×","×","×","×","×","×","×","×","×","×","×","×","×","×","×","×","×","×","×"]
[null,null,32,"×","×","×","×","×","×","×","×","×","×","×","×","×","×","×","×",3,"×","×","×","×","×","×","×","×","×","×","×","×","×"]
[null,null,33,"×","×","×","×","×","×","×","×","×","×","×","×","×","×",3,3,3,"×","×","×","×","×","×","×","×","×","×","×","×","×"]
[null,null,34,"×","×","×","×","×","×","×","×","×","×","×","×",3,3,3,3,3,"×","×","×","×","×","×","×","×","×","×","×","×","×"]
[null,null,35,"×","×","×","×","×","×","×","×","×","×","×",3,3,3,3,3,"×","×","×","×","×","×","×","×","×","×","×","×","×","×"]
[null,null,36,"×","×","×","×","×","×","×","×","×","×","×",3,3,3,3,"×","×","×","×","×","×","×","×","×","×","×","×","×","×","×"]
[null,null,37,"×","×","×","×","×","×","×","×","×","×","×",3,3,"×","×","×","×","×","×","×","×","×","×","×","×","×","×","×","×","×"]
[null,null,38,"×","×","×","×","×","×","×","×","×","×","×",3,"×","×","×","×","×","×","×","×","×","×","×","×","×","×","×","×","×","×"]
[null,null,39,"×","×","×","×","×","×","×","×","×","×","×","×","×","×","×","×","×","×","×","×","×","×","×","×","×","×","×","×","×","×"]
[null,null,40,"×","×","×","×","×","×","×","×","×","×","×","×","×","×","×","×","×","×","×","×","×","×",2,2,"×","×","×","×","×","×"]
[null,null,41,"×","×","×","×","×","×","×","×","×","×","×","×","×","×","×","×","×","×","×","×",2,2,2,2,"×","×","×","×","×","×"]
[null,null,42,"×","×","×","×","×","×","×","×","×","×","×","×","×","×","×","×","×",2,2,2,2,2,2,2,"×","×","×","×","×","×"]
[null,null,43,"×","×","×","×","×","×","×","×","×","×","×","×","×","×","×",2,2,2,2,2,2,2,2,2,"×","×","×","×","×","×"]
[null,null,44,"×","×","×","×","×","×","×","×","×","×","×","×","×","×","×",2,2,2,2,2,2,2,2,2,"×","×","×","×","×","×"]
[null,null,45,"×","×","×","×","×","×","×","×","×","×","×","×","×","×","×",2,2,2,2,2,2,2,2,2,"×","×","×","×","×","×"]
[null,null,46,"×","×","×","×","×","×","×","×","×","×","×","×","×","×","×",2,2,2,2,2,2,2,2,2,"×","×","×","×","×","×"]
[null,null,47,"×","×","×","×","×","×","×","×","×","×","×","×","×","×","×",2,2,2,2,2,2,2,2,2,"×","×","×","×","×","×"]
[null,null,48,"×","×","×","×","×","×","×","×","×","×","×","×","×","×","×",2,2,2,2,2,2,2,2,2,"×","×","×","×","×","×"]
[null,null,49,"×","×","×","×","×","×","×","×","×","×","×","×","×","×","×",2,2,2,2,2,2,2,2,2,"×","×","×","×","×","×"]
[null,null,50,"×","×","×","×","×","×","×","×","×","×","×","×","×","×","×",2,2,2,2,2,2,2,2,2,"×","×","×","×","×","×"]

{"sheet":"S+Sﾁｪｯｸ関数","index":3,"n_rows":131,"n_cols":97,"rows_kept":131,"cut":false,"hidden":true,"merged":[[16,1,16,3],[92,1,92,3],[28,22,28,24],[28,25,28,27],[28,28,28,30],[28,31,28,33],[66,7,66,9],[66,10,66,12],[66,13,66,15],[66,16,66,18],[66,19,66,21],[66,22,66,24],[66,25,66,27],[66,28,66,30],[66,31,66,33],[30,1,42,1],[104,88,104,90],[104,91,104,93],[104,94,104,96],[106,1,118,1],[104,70,104,72],[104,73,104,75],[104,76,104,78],[104,79,104,81],[104,82,104,84],[104,85,104,87],[104,52,104,54],[104,55,104,57],[104,58,104,60],[104,61,104,63],[104,64,104,66],[104,67,104,69],[104,25,104,27],[104,28,104,30],[104,31,104,33],[103,34,103,51],[104,1,105,2],[104,3,104,4],[104,5,104,6],[104,34,104,36],[104,37,104,39],[104,40,104,42],[104,43,104,45],[104,46,104,48],[104,49,104,51],[104,7,104,9],[104,10,104,12],[104,13,104,15],[104,16,104,18],[104,19,104,21],[104,22,104,24],[66,88,66,90],[66,91,66,93],[66,94,66,96],[68,1,80,1],[28,1,29,2],[66,1,67,2],[66,70,66,72],[66,73,66,75],[66,76,66,78],[66,79,66,81],[66,82,66,84],[66,85,66,87],[66,52,66,54],[66,55,66,57],[66,58,66,60],[66,61,66,63],[66,64,66,66],[66,67,66,69],[28,52,28,54],[28,55,28,57],[28,58,28,60],[28,61,28,63],[28,88,28,90],[28,91,28,93],[27,34,27,51],[65,34,65,51],[66,3,66,4],[66,5,66,6],[66,34,66,36],[66,37,66,39],[66,40,66,42],[66,43,66,45],[66,46,66,48],[66,49,66,51],[28,3,28,4],[28,5,28,6],[28,34,28,36],[28,49,28,51],[28,46,28,48],[28,43,28,45],[28,40,28,42],[28,37,28,39],[28,7,28,9],[28,10,28,12],[28,13,28,15],[28,16,28,18],[28,19,28,21],[54,1,54,5],[28,94,28,96],[28,70,28,72],[28,73,28,75],[28,76,28,78],[28,79,28,81],[28,82,28,84],[28,85,28,87],[28,64,28,66],[28,67,28,69]]}
[null,"【ショート同士の連結】"]
[]
[]
[]
[]
[]
[]
[]
[]
[]
[]
[]
[]
[]
[]
[]
[null,"【１段飛ばして連結】"]
[]
[]
[]
[]
[]
[]
[]
[]
[]
[]
[null,null,null,null,null,null,null,null,null,null,null,null,null,null,null,null,null,null,null,null,null,null,null,null,null,null,null,null,null,null,null,null,null,null,"蹴上"]
[null,null,null,"最小",null,"最大",null,10,null,null,20,null,null,30,null,null,40,null,null,50,null,null,60,null,null,70,null,null,80,null,null,90,null,null,100,null,null,110,null,null,120,null,null,130,null,null,140,null,null,150,null,null,160,null,null,170,null,null,180,null,null,190,null,null,200,null,null,210,null,null,220,null,null,230,null,null,240,null,null,250,null,null,260,null,null,270,null,null,280,null,null,290,null,null,300]
[null,null,null,"⑥","③","⑥","③",{"$f":"H29*2","v":20},null,{"$f":"H29*2","v":20},{"$f":"K29*2","v":40},null,{"$f":"K29*2","v":40},{"$f":"N29*2","v":60},null,{"$f":"N29*2","v":60},{"$f":"Q29*2","v":80},null,{"$f":"Q29*2","v":80},{"$f":"T29*2","v":100},null,{"$f":"T29*2","v":100},{"$f":"W29*2","v":120},null,{"$f":"W29*2","v":120},{"$f":"Z29*2","v":140},null,{"$f":"Z29*2","v":140},{"$f":"AC29*2","v":160},null,{"$f":"AC29*2","v":160},{"$f":"AF29*2","v":180},null,{"$f":"AF29*2","v":180},200,null,200,220,null,220,240,null,240,260,null,260,280,null,280,300,null,300,320,null,320,340,null,340,360,null,360,380,null,380,400,null,400,420,null,420,440,null,440,460,null,460,480,null,480,500,null,500,520,null,520,540,null,540,560,null,560,580,null,580,600,null,600]
[null,"踏面",280,280,{"$f":"D31+75*2-79.9*2","v":270.2},{"$f":"(D31-280)*2+D31","v":280},{"$f":"F31+75*2-79.9*2","v":270.2},{"$f":"(($E31^2+H$30^2)^0.5)","v":270.93918136733197},"～",{"$f":"(($G31^2+J$30^2)^0.5)","v":270.93918136733197},{"$f":"(($E31^2+K$30^2)^0.5)","v":273.14472354413147},"～",{"$f":"(($G31^2+M$30^2)^0.5)","v":273.14472354413147},{"$f":"(($E31^2+N$30^2)^0.5)","v":276.7815745312538},"～",{"$f":"(($G31^2+P$30^2)^0.5)","v":276.7815745312538},{"$f":"(($E31^2+Q$30^2)^0.5)","v":281.79432215713643},"～",{"$f":"(($G31^2+S$30^2)^0.5)","v":281.79432215713643},{"$f":"(($E31^2+T$30^2)^0.5)","v":288.11115910356546},"～",{"$f":"(($G31^2+V$30^2)^0.5)","v":288.11115910356546},{"$f":"(($E31^2+W$30^2)^0.5)","v":295.64850752202352},"～",{"$f":"(($G31^2+Y$30^2)^0.5)","v":295.64850752202352},{"$f":"(($E31^2+Z$30^2)^0.5)","v":304.31569134699578},"～",{"$f":"(($G31^2+AB$30^2)^0.5)","v":304.31569134699578},{"$f":"(($E31^2+AC$30^2)^0.5)","v":314.01917138926405},"～",{"$f":"(($G31^2+AE$30^2)^0.5)","v":314.01917138926405},{"$f":"(($E31^2+AF$30^2)^0.5)","v":324.66604380501514},"～",{"$f":"(($G31^2+AH$30^2)^0.5)","v":324.66604380501514},{"$f":"(($E31^2+AI$30^2)^0.5)","v":336.16668484547961},"～",{"$f":"(($G31^2+AK$30^2)^0.5)","v":336.16668484547961},{"$f":"(($E31^2+AL$30^2)^0.5)","v":348.43656524538295},"～",{"$f":"(($G31^2+AN$30^2)^0.5)","v":348.43656524538295},{"$f":"(($E31^2+AO$30^2)^0.5)","v":361.39734365376842},"～",{"$f":"(($G31^2+AQ$30^2)^0.5)","v":361.39734365376842},{"$f":"(($E31^2+AR$30^2)^0.5)","v":374.97738598480839},"～",{"$f":"(($G31^2+AT$30^2)^0.5)","v":374.97738598480839},{"$f":"(($E31^2+AU$30^2)^0.5)","v":389.11186052342322},"～",{"$f":"(($G31^2+AW$30^2)^0.5)","v":389.11186052342322},{"$f":"(($E31^2+AX$30^2)^0.5)","v":403.74254172677911},"～",{"$f":"(($G31^2+AZ$30^2)^0.5)","v":403.74254172677911},{"$f":"(($E31^2+BA$30^2)^0.5)","v":418.81743039181163},"～",{"$f":"(($G31^2+BC$30^2)^0.5)","v":418.81743039181163},{"$f":"(($E31^2+BD$30^2)^0.5)","v":434.29027159262961},"～",{"$f":"(($G31^2+BF$30^2)^0.5)","v":434.29027159262961},{"$f":"(($E31^2+BG$30^2)^0.5)","v":450.12002843686037},"～",{"$f":"(($G31^2+BI$30^2)^0.5)","v":450.12002843686037},{"$f":"(($E31^2+BJ$30^2)^0.5)","v":466.2703507623018},"～",{"$f":"(($G31^2+BL$30^2)^0.5)","v":466.2703507623018},{"$f":"(($E31^2+BM$30^2)^0.5)","v":482.70906351548859},"～",{"$f":"(($G31^2+BO$30^2)^0.5)","v":482.70906351548859},{"$f":"(($E31^2+BP$30^2)^0.5)","v":499.40768916787812},"～",{"$f":"(($G31^2+BR$30^2)^0.5)","v":499.40768916787812},{"$f":"(($E31^2+BS$30^2)^0.5)","v":516.34101134812056},"～",{"$f":"(($G31^2+BU$30^2)^0.5)","v":516.34101134812056},{"$f":"(($E31^2+BV$30^2)^0.5)","v":533.48668212055679},"～",{"$f":"(($G31^2+BX$30^2)^0.5)","v":533.48668212055679},{"$f":"(($E31^2+BY$30^2)^0.5)","v":550.82487235055021},"～",{"$f":"(($G31^2+CA$30^2)^0.5)","v":550.82487235055021},{"$f":"(($E31^2+CB$30^2)^0.5)","v":568.33796283549452},"～",{"$f":"(($G31^2+CD$30^2)^0.5)","v":568.33796283549452},{"$f":"(($E31^2+CE$30^2)^0.5)","v":586.01027294749701},"～",{"$f":"(($G31^2+CG$30^2)^0.5)","v":586.01027294749701},{"$f":"(($E31^2+CH$30^2)^0.5)","v":603.82782314166343},"～",{"$f":"(($G31^2+CJ$30^2)^0.5)","v":603.82782314166343},{"$f":"(($E31^2+CK$30^2)^0.5)","v":621.77812763074894},"～",{"$f":"(($G31^2+CM$30^2)^0.5)","v":621.77812763074894},{"$f":"(($E31^2+CN$30^2)^0.5)","v":639.85001367507994},"～",{"$f":"(($G31^2+CP$30^2)^0.5)","v":639.85001367507994},{"$f":"(($E31^2+CQ$30^2)^0.5)","v":658.03346419464106},"～",{"$f":"(($G31^2+CS$30^2)^0.5)","v":658.03346419464106}]
[null,null,290,290,{"$f":"D32+75*2-79.9*2","v":280.2},{"$f":"(D32-280)*2+D32","v":310},{"$f":"F32+75*2-79.9*2","v":300.2},{"$f":"(($E32^2+H$30^2)^0.5)","v":280.91286905373346},"～",{"$f":"(($G32^2+J$30^2)^0.5)","v":300.86548489316618},283.04070378657553,"～",302.85316574208036,286.55198481252927,"～",306.13728946340399,291.39670554074559,"～",310.67674518701909,297.5097309332923,"～",316.4175089972108,304.81476342198386,"～",323.29559229905993,313.22841505840427,"～",331.24015457066793,322.66397381796435,"～",340.17648360814127,333.03459279780532,"～",350.02862740067417,{"$f":"(($E32^2+AI$30^2)^0.5)","v":344.25577700308821},"～",{"$f":"(($G32^2+AK$30^2)^0.5)","v":360.72155466509065},356.2471613921997,"～",372.182804546368,368.93365257184115,"～",384.34364831489017,382.24604641513298,"～",397.13982424330095,396.12124406550072,"～",410.51192430914841,410.50218026217595,"～",424.40551363053709,425.33756006259307,"～",438.77105647478618,440.58147941101652,"～",453.56371107045146,456.19298547873353,"～",468.74304261503443,472.13561611045611,"～",484.27269177602818,488.37694458276792,"～",500.12002559385678,504.88814602840495,"～",516.25578931378584,521.64359480396195,"～",532.65377122479845,538.62049719630977,"～",549.2904878113219,555.79856063145758,"～",566.14489311482794,573.15969851342481,"～",583.19811385154526,590.68776862230686,"～",600.43321027404875,608.368342371626,"～",617.83496178186613,626.18850197045299,"～",635.3896757108979,644.13666251813368,"～",653.08501743647435,662.20241618405464,"～",670.9098598172485]
[null,null,300,300,290.2,{"$f":"(D33-280)*2+D33","v":340},{"$f":"F33+75*2-79.9*2","v":330.2},290.88836346612425,"～",330.80513901691432,292.94374886656993,"～",332.61395039895723,296.3377127535407,"～",335.60697251398102,301.02498235196362,"～",339.75291021564482,306.94631452421771,"～",345.01020274768683,314.03190920669192,"～",351.32896265466076,322.20496582144727,"～",358.65309144074024,331.38503285453311,"～",366.92238961393457,341.4909076388418,"～",376.07451389319107,{"$f":"(($E33^2+AI$30^2)^0.5)","v":352.44295992401379},"～",{"$f":"(($G33^2+AK$30^2)^0.5)","v":386.04668111512109},364.16485277961681,"～",396.77706586948796,376.58470494697468,"～",408.20587942850602,389.63577864462087,"～",420.27614731269244,403.25679163530521,"～",432.93422133160135,417.39195009008017,"～",446.13007071929144,431.99078693879568,"～",459.81739853989865,447.00787465099535,"～",473.95362642351409,462.40246539135143,"～",488.49978505624745,478.13809720623601,"～",503.42034126562663,494.18219312314358,"～",518.68298603289463,510.50567087937424,"～",534.25840189930568,527.08257417600134,"～",550.12002326765014,543.88973147137096,"～",566.24379908304513,560.90644496208097,"～",582.60796424353828,578.11421016958229,"～",599.19282372204691,595.49646514484027,"～",615.98055164104005,613.03836747792548,"～",632.95500629981586,630.72659687062503,"～",650.10156129638699,648.54918086448924,"～",667.40695231620111,666.49534131905227,"～",684.85913880154942]
[null,null,310,310,300.2,{"$f":"(D34-280)*2+D34","v":370},360.2,300.86548489316618,"～",360.75481978762252,302.85316574208036,"～",362.41418294542501,306.13728946340399,"～",365.16303208293141,310.67674518701909,"～",368.97701825452486,316.4175089972108,"～",373.82354125977673,323.29559229905993,"～",379.66306114764438,331.24015457066793,"～",386.4505660495272,340.17648360814127,"～",394.13708275167409,350.02862740067417,"～",402.67113132182692,360.72155466509065,"～",412.00004854368643,372.182804546368,"～",422.07113144587368,384.34364831489017,"～",432.83257733215964,397.13982424330095,"～",444.23421750243415,410.51192430914841,"～",456.22805700658085,424.40551363053709,"～",468.76864229596242,438.77105647478618,"～",481.81328333702049,453.56371107045146,"～",495.32215779227965,468.74304261503443,"～",509.25832344695158,484.27269177602818,"～",523.58766219230188,500.12002559385678,"～",538.27877535715629,516.25578931378584,"～",553.30284654969921,532.65377122479845,"～",568.63348476852821,549.2904878113219,"～",584.24655754227592,566.14489311482794,"～",600.12002132906707,583.19811385154526,"～",616.23375434975969,600.43321027404875,"～",632.56939540259134,617.83496178186613,"～",649.11019095373933,635.3896757108979,"～",665.84085185575691,653.08501743647435,"～",682.74742035396957,670.9098598172485,"～",699.81714754641439]
[null,null,320,320,310.2,{"$f":"(D35-280)*2+D35","v":400},390.2,310.84407666867321,"～",390.71222146229309,312.76834878228965,"～",392.24487249676059,315.9494263327598,"～",394.78606864984482,320.34987123456131,"～",398.31650731547643,325.92029700526479,"～",402.81017862015352,332.60192422774708,"～",408.23527530089802,340.32931110910795,"～",414.55523154339755,349.03300703515134,"～",421.72981872284061,358.64193842884578,"～",429.71623194848013,369.08541016951614,"～",438.47011300657653,380.29467521909896,"～",447.9464700162286,392.2040795300324,"～",458.10046932960023,404.75182519662587,"～",468.88808899352517,417.88041351563726,"～",480.26663427725225,431.53683504424043,"～",492.19512390920733,445.67257039221067,"～",504.63456084576688,460.24345731362655,"～",517.54810404444527,475.20946960261637,"～",530.90115840898295,490.53444323513105,"～",544.66139940333574,506.18577617313582,"～",558.7987473142723,522.13412070080233,"～",573.28530418980733,538.35308116514011,"～",588.09526439174795,554.81892541621175,"～",603.20480767314848,571.51031486754459,"～",618.59198184263585,588.40805568924702,"～",634.23658046505011,605.49487198489135,"～",650.12001968867253,622.75520070088533,"～",666.22521717509312,640.17500732221652,"～",682.53647521579387,657.74162100326294,"～",699.03936942063569,675.44358757782277,"～",715.72064382690542]
[null,null,330,330,320.2,430,420.2,320.82400159589059,"～",420.67569456768001,322.68876646081128,"～",422.09956171500579,325.77298844440742,"～",424.46205955302997,330.04248211404541,"～",427.74763587891397,335.4519935847751,"～",431.93522662547446,341.94742285912901,"～",436.99890160045021,349.46822459273744,"～",442.90861359878744,357.94977301291868,"～",449.63100426905612,367.32552320795787,"～",457.13022214681888,377.52885982398749,"～",465.36871403221767,388.49458168679774,"～",474.3079590308389,400.16001799280247,"～",483.90912369989468,412.46580464324552,"～",494.13362565200919,425.35636823726992,"～",504.94360081102127,438.78017275168668,"～",516.30227580362259,452.68978340581089,"～",528.17425154961882,467.04179684477918,"～",540.52570706674067,481.79667910852186,"～",553.32453406658192,496.91854463282004,"～",566.5404133863708,512.37490180530892,"～",580.14484398294883,528.13638390097685,"～",594.11113438480515,544.17647872725991,"～",608.41436537938512,560.47126598961336,"～",623.03133147539211,576.99916811031881,"～",637.94046744190791,593.74071782218198,"～",653.12176506375897,610.67834413871265,"～",668.55668420860172,627.79617711483399,"～",684.22806139473698,645.07987102373613,"～",700.12001828257985,662.51644507891274,"～",716.2178718797793,680.09414054232229,"～",732.50804773736104]
[null,null,340,340,330.2,460,450.2,330.80513901691432,"～",450.64402803099472,332.61395039895723,"～",451.973494798091,335.60697251398102,"～",454.18062486195947,339.75291021564482,"～",457.25270912264693,345.01020274768683,"～",461.17246231751523,351.32896265466076,"～",465.91849072557744,358.65309144074024,"～",471.46584181677463,366.92238961393457,"～",477.78660508641303,376.07451389319107,"～",484.85053366991355,386.04668111512109,"～",{"$f":"(($G37^2+AK$30^2)^0.5)","v":492.62565909623504},396.77706586948796,"～",501.07887602651937,408.20587942850602,"～",510.17647926967391,420.27614731269244,"～",519.88464105030073,432.93422133160135,"～",530.16982184956544,446.13007071929144,"～",540.9991127534314,459.81739853989865,"～",552.34051091695233,473.95362642351409,"～",564.1631324360003,488.49978505624745,"～",576.43736867069958,503.42034126562663,"～",589.1349930194267,518.68298603289463,"～",602.22922546153472,534.25840189930568,"～",615.69476203716397,550.12002326765014,"～",629.50777596468174,566.24379908304513,"～",643.64589643685292,582.60796424353828,"～",658.08817038448581,599.19282372204691,"～",672.81501172313324,615.98055164104005,"～",687.80814185352585,632.95500629981586,"～",703.05052450019548,650.10156129638699,"～",718.5262973614814,667.40695231620111,"～",734.22070251389675,684.85913880154942,"～",750.1200170639363]
[null,null,350,350,340.2,490,480.2,340.78738239553411,"～",480.616312665311,342.54348629042704,"～",481.86309258958607,345.45048849292425,"～",483.93392110907041,349.47967036724754,"～",486.81828231897782,354.59278052436429,"～",490.50182466531152,360.74373175427456,"～",494.96670595101642,367.88046971808654,"～",500.19200313479621,375.94685794670499,"～",506.15416623791606,384.88445019252202,"～",512.82749536271945,394.63405833759452,"～",520.18462107217283,405.13706322675534,"～",528.19697083569122,416.33645048205904,"～",536.8352074892257,428.17757998288511,"～",546.06962925985908,440.60871530191048,"～",555.87052449288944,453.58134882289858,"～",566.20847750629798,467.05036131021245,"～",577.05462479734103,480.97405335423241,"～",588.38086304705723,495.31408217412917,"～",600.16001199680068,510.03533210945295,"～",612.36593634852022,525.10574173208192,"～",624.97363144375936,540.49610544387826,"～",637.95927769725233,556.17986299397785,"～",651.30026869332698,572.13288666183132,"～",664.97521758333221,588.33327289895817,"～",678.96394602364558,604.76114293165358,"～",693.24745942556467,621.39845509946349,"～",707.80791179528364,638.22883043623153,"～",722.62856295610129,655.23739209541452,"～",737.69373048711759,672.41061859551269,"～",752.98873829560034,689.73621044570359,"～",768.49986337018959]
[null,null,360,360,350.2,520,510.2,350.77063731161991,"～",510.59185265728632,352.47700634225771,"～",511.76561041164143,355.30274414926771,"～",513.71591371107047,359.22143588600056,"～",516.43396480092201,364.19780339809847,"～",519.90772258161348,370.18919487202754,"～",524.12216133264201,377.14723915203194,"～",529.05958076572051,385.01953197208059,"～",534.69995324480806,393.75124126788472,"～",541.02129348113465,403.28654825074437,"～",548.00003649634914,413.5698731774354,"～",555.61141096993322,424.54686431535447,"～",563.82979701324757,436.1651522072803,"～",572.62905968873076,448.37488778922483,"～",581.98285198105282,461.12909255435181,"～",591.86488322927221,474.38385301356959,"～",602.24915109944322,488.09839172035794,"～",613.11013692484323,502.23504457574444,"～",624.42296562506408,516.75917021374664,"～",636.1635324348606,531.63901286493262,"～",648.3085993568186,546.84553577770021,"～",660.83586464416408,562.35223837022284,"～",673.72400877510665,578.13496694111143,"～",686.9527203527183,594.17172601866537,"～",700.50270520534036,610.44249524422855,"～",714.35568171604825,626.92905499745348,"～",728.49436511204397,643.61482270065846,"～",742.90244312426387,660.48470080691493,"～",757.56454510490391,677.52493681044689,"～",772.46620638057686,694.72299515706254,"～",787.59382933082964]
[null,null,370,370,360.2,550,540.20000000000005,360.75481978762252,"～",540.57010646168737,362.41418294542501,"～",541.67890857961231,365.16303208293141,"～",543.52188548392428,368.97701825452486,"～",546.0916040372714,373.82354125977673,"～",549.37786631789243,379.66306114764438,"～",553.36790655042512,386.4505660495272,"～",558.04662887611823,394.13708275167409,"～",563.39687610067563,402.67113132182692,"～",569.39971900238947,412.00004854368643,"～",576.03475589585742,422.07113144587368,"～",583.2804128375991,432.83257733215964,"～",591.11423599842362,444.23421750243415,"～",599.51316916311362,456.22805700658085,"～",608.45381090104127,468.76864229596242,"～",617.91264754817894,481.81328333702049,"～",627.86625964452014,495.32215779227965,"～",638.29150080507895,509.25832344695158,"～",649.16564912200954,523.58766219230188,"～",660.46653208167936,538.27877535715629,"～",672.17262663693771,553.30284654969921,"～",684.26313651986254,568.63348476852821,"～",696.7180491418319,584.24655754227592,"～",709.51817453818614,600.12002132906707,"～",722.64516880693259,616.23375434975969,"～",736.08154439572797,632.56939540259134,"～",749.8106694359584,649.11019095373933,"～",763.81675812985407,665.84085185575691,"～",778.08485398444816,682.74742035396957,"～",792.60080746867777,699.81714754641439,"～",807.35124945713687]
[null,null,380,380,370.2,580,570.20000000000005,370.7398548847965,"～",570.55064630582979,372.35472334858326,"～",571.60129461015049,375.03071874181182,"～",573.34809670914581,378.74534980643654,"～",575.78471671276588,383.46843416375225,"～",578.90244428573635,389.16325623059532,"～",582.69034658212763,395.78787247716417,"～",587.13545285564214,403.2964666346582,"～",592.22296476918223,411.64066854478796,"～",597.93648492126658,420.7707689467033,"～",604.25825604620422,430.63678430900438,"～",611.169403684445,441.18934710620562,"～",618.65017578596064,452.38041513752557,"～",626.6801736133034,464.16380729221015,"～",635.2385693580012,476.49558235098044,"～",644.30430698544922,489.33428246956089,"～",653.85628390342788,502.64106477684447,"～",663.87351204879383,516.37974398692279,"～",674.33525786510677,530.51676693578679,"～",685.22116137784303,545.02113720478769,"～",696.51133515543017,559.86430498827121,"～",708.18644437746764,575.02003443358387,"～",720.22776952850131,590.46425802075441,"～",732.61725341408669,606.17492524847967,"～",745.33753427557906,622.1318509769452,"～",758.37196678147325,638.31656722977198,"～",771.70463261535497,654.7121810383552,"～",785.32034228077907,671.30323997430548,"～",799.20462961622036,688.0756063108181,"～",813.34374037057671,705.01634023616782,"～",827.72461604086664]
[null,null,390,390,380.2,610,600.20000000000005,380.72567551978943,"～",600.53312981050431,382.29836515475705,"～",601.53141231360485,384.90523509040503,"～",603.1915450335822,388.52546892063583,"～",605.50808417394398,393.13107229014599,"～",608.47353270294354,398.68789798537898,"～",612.07845902302427,405.15680914924775,"～",616.31164194748101,412.49489693813183,"～",621.16023697593528,420.65667711329627,"～",626.60995842709042,429.59520481495133,"～",632.6452718546152,439.26306468903118,"～",639.24959131782009,449.61321154966072,"～",646.40547646194955,460.59965262687723,"～",654.09482492984148,472.17797492047424,"～",662.29905631821646,484.30572988557549,"～",670.99928464939512,496.94269287313199,"～",680.17647709987739,510.0510170561372,"～",689.8115974670186,523.59530173598773,"～",699.88573353083859,537.54259366119072,"～",710.38020805762881,551.86233790683707,"～",721.27667368354571,566.52629241721866,"～",732.55719230651198,581.50841782385226,"～",744.20429990695436,596.78475181592898,"～",756.2010579204449,612.33327526764378,"～",768.53109240940933,628.13377556058867,"～",781.17862233934693,644.16771108151636,"～",794.12847827036148,660.41807970406137,"～",807.36611273944368,676.86929314307054,"～",820.87760354391446,693.50705836350357,"～",834.64965105126601,710.3182666945853,"～",848.6695705632435]
[null,null,400,400,390.2,{"$f":"(D43-280)*2+D43","v":640},630.20000000000005,390.71222146229309,"～",630.51727969977162,392.24487249676059,"～",631.46816230115678,394.78606864984482,"～",633.04979267037129,398.31650731547643,"～",635.25745961775215,402.81017862015352,"～",638.08466522868264,408.23527530089802,"～",641.52321859773713,414.55523154339755,"～",645.56335088045387,421.72981872284061,"～",650.19384801765079,429.71623194848013,"～",655.40219712783994,438.47011300657653,"～",661.17474240929687,447.9464700162286,"～",667.49684643449814,458.10046932960023,"～",674.35305293295744,468.88808899352517,"～",681.72724751178896,480.26663427725225,"～",689.60281321931973,492.19512390920733,"～",697.96277837718537,504.63456084576688,"～",706.78995465413914,517.54810404444527,"～",716.06706389834744,530.90115840898295,"～",725.77685275847705,544.66139940333574,"～",735.90219458838419,558.7987473142723,"～",746.42617853341665,573.28530418980733,"～",757.33218603199487,588.09526439174795,"～",768.60395523312263,603.20480767314848,"～",780.22563403159222,618.59198184263585,"～",792.181822563482,634.23658046505011,"～",804.45760609245281,650.12001968867253,"～",817.03857926049,666.22521717509312,"～",829.91086268345714,682.53647521579387,"～",843.06111285007091,699.03936942063569,"～",856.47652623991985,715.72064382690542,"～",870.14483851827799]
[null,null,410,410,{"$f":"D44+75*2-79.9*2","v":400.2},{"$f":"(D44-280)*2+D44","v":670},{"$f":"F44+75*2-79.9*2","v":660.2},400.69943848226188,"～",660.502869032376,402.1940327752265,"～",661.41064400264986,404.67275668124728,"～",662.92083991982031,408.11767910738683,"～",665.02935273565186,412.50459391381327,"～",667.73051450416733,417.8038295659818,"～",671.01716818573277,423.98117882755122,"～",674.88075983835847,430.998886309466,"～",679.31144550934812,438.81663596541091,"～",684.29820984713967,447.39248987885344,"～",689.82899330196324,456.68374177323193,"～",695.89082477066768,466.64766151776649,"～",702.46995665295185,477.24211884535083,"～",709.55199950391238,488.42608447952489,"～",717.12205376769725,500.16001439539326,"～",725.16483643375875,512.40612798833695,"～",733.66480084572686,525.12859377489622,"～",742.60624829043832,538.29363733932428,"～",751.97343038168583,551.86958604365941,"～",761.75064161443277,565.82686397872624,"～",771.92230178950012,580.1379491121055,"～",782.47302828915451,594.77730286217206,"～",793.38769841736269,609.72128058646604,"～",804.65150220452585,624.94802983928184,"～",816.24998621745783,640.43738179466072,"～",828.16908901503928,656.17073997550358,"～",840.3951689532729,672.13096938022431,"～",852.91502507576922,688.30228824260053,"～",865.71591183251337,704.67016397744555,"～",878.78554835636669,721.22121433024972,"～",892.11212299800081]
[null,null,420,420,{"$f":"D45+75*2-79.9*2","v":410.2},{"$f":"(D45-280)*2+D45","v":700},690.2,410.68727762130635,"～",690.48971027814753,412.14565386523242,"～",691.35811270281624,414.56488032634888,"～",692.80303117119809,417.92827135765771,"～",694.82086900150034,422.21326364764997,"～",697.40665325188866,427.39213843963012,"～",700.55409498481993,433.43285523827097,"～",704.25566380399107,440.29994322052778,"～",708.50267465973627,447.95539956562635,"～",713.28538468133502,456.35955123126325,"～",718.59309765680325,465.47184662447631,"～",724.41427374120678,475.25155444248679,"～",730.73664202638702,485.65835728421268,"～",737.54731373654943,496.65283649648069,"～",744.83289401046193,508.19685162346292,"～",752.57959047531983,520.25382266735915,"～",760.77331709254895,532.78892631134886,"～",769.39979204572182,545.7692186263348,"～",778.44462873090731,559.16369696181096,"～",787.89341918815387,572.94331307730613,"～",797.73180957010857,587.08094842193611,"～",807.94556747345302,601.55136106570319,"～",818.52064115695953,616.33111230896009,"～",829.44321083483464,631.3984795673806,"～",840.69973236584303,646.73336082190781,"～",852.27697375911782,662.31717477353698,"～",864.16204498924856,678.13275986343558,"～",876.34242165947899,694.1642745056821,"～",888.80596307630617,710.39710021930694,"～",901.54092530511343,726.81774882015645,"～",914.53596976827544]
[null,null,430,430,420.2,730,720.2,420.67569456768001,"～",720.47764712029755,422.09956171500579,"～",721.30994724875382,424.46205955302997,"～",722.69498407004323,427.74763587891397,"～",724.62958813451723,431.93522662547446,"～",727.10937279064149,436.99890160045021,"～",730.1287831608887,442.90861359878744,"～",733.68115690673153,449.63100426905612,"～",737.75879527119162,457.13022214681888,"～",742.35304269599385,465.36871403221767,"～",747.45437318942754,474.3079590308389,"～",753.05248157083986,483.90912369989468,"～",759.13637773459391,494.13362565200919,"～",765.69448215329328,504.94360081102127,"～",772.7147209675768,516.30227580362259,"～",780.18461917676893,528.17425154961882,"～",788.09139063943599,540.52570706674067,"～",796.42202380396293,553.32453406658192,"～",805.16336230606021,566.5404133863708,"～",814.30217978340204,580.14484398294883,"～",823.8252484598903,594.11113438480515,"～",833.71940123761067,608.41436537938512,"～",843.97158719947436,623.03133147539211,"～",854.56892056755726,637.94046744190791,"～",865.49872328039862,653.12176506375897,"～",876.74856144735134,668.55668420860172,"～",888.30627601070114,684.22806139473698,"～",900.16000799857807,700.12001828257985,"～",912.29821878594066,716.2178718797793,"～",924.70970579960931,732.50804773736104,"～",937.38361410897301]
[null,null,440,440,430.2,760,750.2,430.66464911808117,"～",750.4665482218378,432.05559827411099,"～",751.2656254614609,434.36394878028261,"～",752.59553546377094,437.5751821116001,"～",754.45347106365682,441.66960502167228,"～",756.83554356280069,446.62292820678158,"～",759.73682285380903,452.40694070714693,"～",763.15138734067705,458.99023954764004,"～",767.07238250376349,466.33897542452956,"～",771.4920868032284,474.41757977545478,"～",{"$f":"(($G47^2+AK$30^2)^0.5)","v":776.40198351111906},483.18944524896233,"～",781.79283700990766,492.61753927362349,"～",787.65477209244409,502.66493810489703,"～",793.97735484080408,513.29527564550995,"～",800.74967374329913,524.47310703219091,"～",807.96041982265444,536.16419126980122,"～",815.59796468603327,548.33570009620928,"～",823.65043556110629,560.95636193914402,"～",832.10578654399467,573.99655051228308,"～",840.95186544771991,587.4283275430289,"～",850.17647579781931,601.22544856318245,"～",859.76743367029201,615.36333982453004,"～",869.7126192024582,629.8190533796195,"～",880.00002272727249,644.57120630695249,"～",890.61778558481535,659.59990903577295,"～",901.55423575068403,674.88668678527063,"～",912.79791849017715,690.41439730063564,"～",924.33762230042328,706.16714735252299,"～",936.16240044129097,722.13020986522918,"～",948.26158838160268,738.2899430440591,"～",960.62481750160919]
[null,null,450,450,440.2,790,780.2,440.65410471252846,"～",780.45630242826542,442.0136196996649,"～",781.22470519051046,444.27023307892233,"～",782.50369967176516,447.41037091243203,"～",784.29078790968856,451.41559565438143,"～",786.58250679760226,456.26312583858885,"～",789.37446120329992,461.92644436100426,"～",792.66136527523531,468.3759601004304,"～",796.43709104988329,475.57968838040171,"～",800.69472334966713,483.50391932227393,"～",805.4266198729714,492.11384861635418,"～",810.62447532750946,501.3741517070859,"～",816.27938844491234,511.24948899729964,"～",822.38193073534876,521.70493576350225,"～",828.92221589242013,532.70633561090676,"～",835.88996883561174,544.22058027972446,"～",843.27459347474712,556.21582142186492,"～",851.06523839245131,568.66162170485882,"～",859.25085976098978,581.52905344445173,"～",867.82028093378881,594.79075312247414,"～",876.76224827486726,608.42093981058872,"～",886.06548290744297,622.39540486735598,"～",895.71872817308008,636.69147944667827,"～",905.71079269267852,651.28798545651057,"～",916.03058900890426,666.16517471269844,"～",926.66716786557197,681.30466019248684,"～",937.60974824283903,696.68934253367183,"～",948.84774331817857,712.30333426146478,"～",960.3707825626517,728.13188365844826,"～",972.16873021096501,744.16129971935527,"～",984.23170036328338]
[null,null,460,460,450.2,820,810.2,450.64402803099472,"～",810.44681503476841,451.973494798091,"～",811.18680955745333,454.18062486195947,"～",812.41863592608468,457.25270912264693,"～",814.1400616601544,461.17246231751523,"～",816.3479895240755,465.91849072557744,"～",819.03848505427391,471.46584181677463,"～",822.20681096668136,477.78660508641303,"～",825.84746775660699,484.85053366991355,"～",829.95423970240677,492.62565909623504,"～",834.52024541049934,501.07887602651937,"～",839.53799199321531,510.17647926967391,"～",844.99943195247181,519.88464105030073,"～",850.89602184990849,530.16982184956544,"～",857.21878187543234,540.9991127534314,"～",863.95835547785521,552.34051091695233,"～",871.10506828969835,564.1631324360003,"～",878.64898565923352,576.43736867069958,"～",886.57996819237917,589.1349930194267,"～",894.88772480127363,602.22922546153472,"～",903.56186285168098,615.69476203716397,"～",912.59193509476074,629.50777596468174,"～",921.96748315762204,643.64589643685292,"～",931.67807744950187,658.08817038448581,"～",941.71335341493386,672.81501172313324,"～",952.06304413100713,687.80814185352585,"～",962.71700930231827,703.05052450019548,"～",973.66526075443403,718.5262973614814,"～",984.89798456489905,734.22070251389675,"～",996.40556000054517,750.1200170639363,"～",1008.1785754517897]
[null,null,470,470,460.2,{"$f":"(D50-280)*2+D50","v":850},840.2,460.63438864244597,"～",840.43800485223187,461.93510366717095,"～",841.15161534648439,464.09486099287932,"～",842.33962271758298,467.10174480513342,"～",844.00002369668221,470.93952902681673,"～",846.13003728741364,475.58809909416362,"～",848.72612779388385,481.02394950771418,"～",851.78403366111536,487.22073026504114,"～",855.29880158924584,494.14981533943728,"～",859.26482530125713,501.78086850735946,"～",863.67588828217265,510.08238550257738,"～",868.52520976653295,519.02219605716289,"～",873.80549323061598,528.56791427403152,"～",879.50897664549166,538.68733046174384,"～",885.62748376504214,549.34874169328907,"～",892.15247575736737,560.52122172135466,"～",899.07510253593387,572.17483342069488,"～",906.38625320555252,584.28078866243754,"～",914.07660510484573,596.81156155020994,"～",922.13667099839381,609.74096139262281,"～",930.55684404554245,623.04417178880658,"～",939.32744024647764,636.69776189334914,"～",948.43873813757739,650.67967541640644,"～",957.88101557552545,664.96920229436193,"～",967.64458351194219,679.54693730455438,"～",977.71981671642516,694.39472924266931,"～",988.09718145534657,709.49562366514988,"～",998.76726017626356,724.83380164007258,"～",1009.7207732833865,740.39451645727365,"～",1020.9485981184362,756.16402982421744,"～",1032.4417852837998]
[null,null,480,480,470.2,880,870.2,470.62515869851239,"～",870.42980187950832,471.89833650904086,"～",871.11884378654099,474.01270025179701,"～",872.26603739914117,476.95706305704289,"～",873.86957836967872,480.71617405700005,"～",875.9269604253542,485.27109948975942,"～",878.43499474918463,490.59967386862377,"～",881.38983429581265,496.67699765541789,"～",884.78700261701408,503.47595771794306,"～",888.62142670543346,510.96774849299442,"～",892.88747331340699,519.12237478267105,"～",897.57898816761531,527.90912096685736,"～",902.68933747995493,537.29697561032299,"～",908.21145115000616,547.25500454541293,"～",914.13786706382541,557.75266920024683,"～",920.46077591606263,568.76009002038813,"～",927.1720660157963,580.24825721409968,"～",934.26336757897127,592.18919274164398,"～",941.72609605978323,604.55606853293602,"～",949.55149412762239,617.32328645532232,"～",957.73067195323756,630.46652567761282,"～",966.25464552570202,643.96276289860111,"～",975.11437277890639,657.79027052701224,"～",984.30078736126188,671.92859739707455,"～",993.80482993392627,686.35853604366275,"～",1003.6174769303293,701.06207999006767,"～",1013.7297667524615,716.02237395209931,"～",1024.1328234169628,731.22365935464643,"～",1034.8178776963607,746.65121710206836,"～",1045.7762858279011,762.29130914631321,"～",1056.9995458844814]
[null,null,490,490,480.2,910,900.2,480.616312665311,"～",900.42214544068167,481.86309258958607,"～",901.08825316946616,483.93392110907041,"～",902.1973398320348,486.81828231897782,"～",903.74777454774403,490.50182466531152,"～",905.73729082996249,494.96670595101642,"～",908.16300299010197,500.19200313479621,"～",911.02142675131415,506.15416623791606,"～",914.30850373383271,512.82749536271945,"～",918.01962941976353,520.18462107217283,"～",922.14968416195859,528.19697083569122,"～",926.69306677022246,536.8352074892257,"～",931.64373018874551,546.06962925985908,"～",936.99521877115251,555.87052449288944,"～",942.74070666329033,566.20847750629798,"～",948.87303681788751,577.05462479734103,"～",955.384760188271,588.38086304705723,"～",962.26817467897172,600.16001199680068,"～",969.51536346774822,612.36593634852022,"～",977.11823235471354,624.97363144375936,"～",985.06854583830864,637.95927769725233,"～",993.3579616633674,651.30026869332698,"～",1001.9780636321336,664.97521758333221,"～",1010.9203925136736,678.96394602364558,"～",1020.1764749297055,693.24745942556467,"～",1029.7378501346836,707.80791179528364,"～",1039.5960946444538,722.62856295610129,"～",1049.7428447005486,737.69373048711759,"～",1060.1698165860034,752.98873829560034,"～",1070.8688248333688,768.49986337018959,"～",1081.831798386422]
[null,null,500,500,490.2,{"$f":"(D53-280)*2+D53","v":940},930.2,490.60782708799093,"～",930.4149826824588,491.82927932362873,"～",931.05963289147064,493.8583197638772,"～",932.13305917127525,496.68505111388242,"～",933.63378259358205,500.2959524121697,"～",935.55974688952926,504.67419192980333,"～",937.90833240781058,509.79999999999995,"～",940.67637368013027,515.65108358268765,"～",943.86018032333584,522.20306395117984,"～",947.45556096315147,529.42991981942237,"～",951.45784982835687,537.30442023121304,"～",955.86193563715051,545.79853425966621,"～",960.66229237958544,554.88380765706256,"～",965.85301159130836,564.53169972996204,"～",971.42783571400719,574.71387663775783,"～",977.38019214633152,585.40245985134015,"～",983.70322760474869,596.57023056803632,"～",990.38984243579557,608.1907924327694,"～",997.43272454837779,620.23869598727879,"～",1004.8243826659462,632.68952891603954,"～",1012.557178632397,645.51997645309166,"～",1020.6233585412398,658.70785633693481,"～",1029.0150824939351,672.23213252566256,"～",1037.7244528293627,686.07291157718794,"～",1046.7435407013506,700.21142521384206,"～",1056.06441091441,714.63000216895455,"～",1065.6791449587442,729.31203198630976,"～",1075.5798622138666,744.24192303309553,"～",1085.7587393155075,759.40505660681504,"～",1096.2080277027715,774.78773867427719,"～",1106.9200693817056]
[]
[null,"【２段飛ばして連結】"]
[]
[]
[]
[]
[]
[]
[]
[]
[]
[]
[null,null,null,null,null,null,null,null,null,null,null,null,null,null,null,null,null,null,null,null,null,null,null,null,null,null,null,null,null,null,null,null,null,null,"蹴上"]
[null,null,null,"最小",null,"最大",null,10,null,null,20,null,null,30,null,null,40,null,null,50,null,null,60,null,null,70,null,null,80,null,null,90,null,null,100,null,null,110,null,null,120,null,null,130,null,null,140,null,null,150,null,null,160,null,null,170,null,null,180,null,null,190,null,null,200,null,null,210,null,null,220,null,null,230,null,null,240,null,null,250,null,null,260,null,null,270,null,null,280,null,null,290,null,null,300]
[null,null,null,"⑥","③","⑥","③",{"$f":"H67*3","v":30},null,{"$f":"H67*3","v":30},{"$f":"K67*3","v":60},null,{"$f":"K67*3","v":60},{"$f":"N67*3","v":90},null,{"$f":"N67*3","v":90},{"$f":"Q67*3","v":120},null,{"$f":"Q67*3","v":120},{"$f":"T67*3","v":150},null,{"$f":"T67*3","v":150},{"$f":"W67*3","v":180},null,{"$f":"W67*3","v":180},{"$f":"Z67*3","v":210},null,{"$f":"Z67*3","v":210},{"$f":"AC67*3","v":240},null,{"$f":"AC67*3","v":240},{"$f":"AF67*3","v":270},null,{"$f":"AF67*3","v":270},{"$f":"AI67*3","v":300},null,{"$f":"AI68","v":300},{"$f":"AL67*3","v":330},null,{"$f":"AL68","v":330},{"$f":"AO67*3","v":360},null,{"$f":"AO68","v":360},{"$f":"AR67*3","v":390},null,{"$f":"AR68","v":390},{"$f":"AU67*3","v":420},null,{"$f":"AU68","v":420},{"$f":"AX67*3","v":450},null,{"$f":"AX68","v":450},{"$f":"BA67*3","v":480},null,{"$f":"BA68","v":480},{"$f":"BD67*3","v":510},null,{"$f":"BD68","v":510},{"$f":"BG67*3","v":540},null,{"$f":"BG68","v":540},{"$f":"BJ67*3","v":570},null,{"$f":"BJ68","v":570},{"$f":"BM67*3","v":600},null,{"$f":"BM68","v":600},{"$f":"BP67*3","v":630},null,{"$f":"BP68","v":630},{"$f":"BS67*3","v":660},null,{"$f":"BS68","v":660},{"$f":"BV67*3","v":690},null,{"$f":"BV68","v":690},{"$f":"BY67*3","v":720},null,{"$f":"BY68","v":720},{"$f":"CB67*3","v":750},null,{"$f":"CB68","v":750},{"$f":"CE67*3","v":780},null,{"$f":"CE68","v":780},{"$f":"CH67*3","v":810},null,{"$f":"CH68","v":810},{"$f":"CK67*3","v":840},null,{"$f":"CK68","v":840},{"$f":"CN67*3","v":870},null,{"$f":"CN68","v":870},{"$f":"CQ67*3","v":900},null,{"$f":"CQ68","v":900}]
[null,"踏面",280,{"$f":"C69*2","v":560},{"$f":"E31+C69","v":550.20000000000005},{"$f":"F31+C69","v":560},{"$f":"F69+75*2-79.9*2","v":550.20000000000005},{"$f":"(($E69^2+H$68^2)^0.5)","v":551.01727740607191},"～",{"$f":"(($G69^2+J$68^2)^0.5)","v":551.01727740607191},{"$f":"(($E69^2+K$68^2)^0.5)","v":553.46186860523642},"～",{"$f":"(($G69^2+M$68^2)^0.5)","v":553.46186860523642},{"$f":"(($E69^2+N$68^2)^0.5)","v":557.51236757582342},"～",{"$f":"(($G69^2+P$68^2)^0.5)","v":557.51236757582342},{"$f":"(($E69^2+Q$68^2)^0.5)","v":563.13412256761717},"～",{"$f":"(($G69^2+S$68^2)^0.5)","v":563.13412256761717},{"$f":"(($E69^2+T$68^2)^0.5)","v":570.2806677417708},"～",{"$f":"(($G69^2+V$68^2)^0.5)","v":570.2806677417708},{"$f":"(($E69^2+W$68^2)^0.5)","v":578.89553461742992},"～",{"$f":"(($G69^2+Y$68^2)^0.5)","v":578.89553461742992},{"$f":"(($E69^2+Z$68^2)^0.5)","v":588.91428917967346},"～",{"$f":"(($G69^2+AB$68^2)^0.5)","v":588.91428917967346},{"$f":"(($E69^2+AC$68^2)^0.5)","v":600.26664075225767},"～",{"$f":"(($G69^2+AE$68^2)^0.5)","v":600.26664075225767},{"$f":"(($E69^2+AF$68^2)^0.5)","v":612.87848714080349},"～",{"$f":"(($G69^2+AH$68^2)^0.5)","v":612.87848714080349},{"$f":"(($E69^2+AI$68^2)^0.5)","v":626.67379073964787},"～",{"$f":"(($G69^2+AK$68^2)^0.5)","v":626.67379073964787},{"$f":"(($E69^2+AL$68^2)^0.5)","v":641.57621526986179},"～",{"$f":"(($G69^2+AN$68^2)^0.5)","v":641.57621526986179},{"$f":"(($E69^2+AO$68^2)^0.5)","v":657.51048660838865},"～",{"$f":"(($G69^2+AQ$68^2)^0.5)","v":657.51048660838865},{"$f":"(($E69^2+AR$68^2)^0.5)","v":674.40346974196393},"～",{"$f":"(($G69^2+AT$68^2)^0.5)","v":674.40346974196393},{"$f":"(($E69^2+AU$68^2)^0.5)","v":692.18497527756267},"～",{"$f":"(($G69^2+AW$68^2)^0.5)","v":692.18497527756267},{"$f":"(($E69^2+AX$68^2)^0.5)","v":710.78832292040363},"～",{"$f":"(($G69^2+AZ$68^2)^0.5)","v":710.78832292040363},{"$f":"(($E69^2+BA$68^2)^0.5)","v":730.1506967743029},"～",{"$f":"(($G69^2+BC$68^2)^0.5)","v":730.1506967743029},{"$f":"(($E69^2+BD$68^2)^0.5)","v":750.213329660304},"～",{"$f":"(($G69^2+BF$68^2)^0.5)","v":750.213329660304},{"$f":"(($E69^2+BG$68^2)^0.5)","v":770.9215524292988},"～",{"$f":"(($G69^2+BI$68^2)^0.5)","v":770.9215524292988},{"$f":"(($E69^2+BJ$68^2)^0.5)","v":792.22474084062787},"～",{"$f":"(($G69^2+BL$68^2)^0.5)","v":792.22474084062787},{"$f":"(($E69^2+BM$68^2)^0.5)","v":814.07618808069799},"～",{"$f":"(($G69^2+BO$68^2)^0.5)","v":814.07618808069799},{"$f":"(($E69^2+BP$68^2)^0.5)","v":836.43292618117323},"～",{"$f":"(($G69^2+BR$68^2)^0.5)","v":836.43292618117323},{"$f":"(($E69^2+BS$68^2)^0.5)","v":859.25551496629919},"～",{"$f":"(($G69^2+BU$68^2)^0.5)","v":859.25551496629919},{"$f":"(($E69^2+BV$68^2)^0.5)","v":882.50781299657626},"～",{"$f":"(($G69^2+BX$68^2)^0.5)","v":882.50781299657626},{"$f":"(($E69^2+BY$68^2)^0.5)","v":906.15674140846079},"～",{"$f":"(($G69^2+CA$68^2)^0.5)","v":906.15674140846079},{"$f":"(($E69^2+CB$68^2)^0.5)","v":930.17204860176275},"～",{"$f":"(($G69^2+CD$68^2)^0.5)","v":930.17204860176275},{"$f":"(($E69^2+CE$68^2)^0.5)","v":954.52608136184529},"～",{"$f":"(($G69^2+CG$68^2)^0.5)","v":954.52608136184529},{"$f":"(($E69^2+CH$68^2)^0.5)","v":979.19356615533377},"～",{"$f":"(($G69^2+CJ$68^2)^0.5)","v":979.19356615533377},{"$f":"(($E69^2+CK$68^2)^0.5)","v":1004.1514029268694},"～",{"$f":"(($G69^2+CM$68^2)^0.5)","v":1004.1514029268694},{"$f":"(($E69^2+CN$68^2)^0.5)","v":1029.3784726717379},"～",{"$f":"(($G69^2+CP$68^2)^0.5)","v":1029.3784726717379},{"$f":"(($E69^2+CQ$68^2)^0.5)","v":1054.8554592928833},"～",{"$f":"(($G69^2+CS$68^2)^0.5)","v":1054.8554592928833}]
[null,null,290,{"$f":"C70*2","v":580},570.20000000000005,600,{"$f":"F70+75*2-79.9*2","v":590.20000000000005},{"$f":"(($E70^2+H$68^2)^0.5)","v":570.98865137583959},"～",{"$f":"(($G70^2+J$68^2)^0.5)","v":590.96196155082612},{"$f":"(($E70^2+K$68^2)^0.5)","v":573.34809670914581},"～",{"$f":"(($G70^2+M$68^2)^0.5)","v":593.24197423985436},{"$f":"(($E70^2+N$68^2)^0.5)","v":577.2590752859586},"～",{"$f":"(($G70^2+P$68^2)^0.5)","v":597.02264613664363},{"$f":"(($E70^2+Q$68^2)^0.5)","v":582.69034658212763},"～",{"$f":"(($G70^2+S$68^2)^0.5)","v":602.27571759120428},{"$f":"(($E70^2+T$68^2)^0.5)","v":589.5998982360835},"～",{"$f":"(($G70^2+V$68^2)^0.5)","v":608.9630859091543},{"$f":"(($E70^2+W$68^2)^0.5)","v":597.93648492126658},"～",{"$f":"(($G70^2+Y$68^2)^0.5)","v":617.03811875766644},{"$f":"(($E70^2+Z$68^2)^0.5)","v":607.64137449650354},"～",{"$f":"(($G70^2+AB$68^2)^0.5)","v":626.44715659024268},{"$f":"(($E70^2+AC$68^2)^0.5)","v":618.65017578596064},"～",{"$f":"(($G70^2+AE$68^2)^0.5)","v":637.13110110871219},{"$f":"(($E70^2+AF$68^2)^0.5)","v":630.8946346260999},"～",{"$f":"(($G70^2+AH$68^2)^0.5)","v":649.02699481608624},{"$f":"(($E70^2+AI$68^2)^0.5)","v":644.30430698544922},"～",{"$f":"(($G70^2+AK$68^2)^0.5)","v":662.06951296672776},{"$f":"(($E70^2+AL$68^2)^0.5)","v":658.80804488105639},"～",{"$f":"(($G70^2+AN$68^2)^0.5)","v":676.19230992373764},{"$f":"(($E70^2+AO$68^2)^0.5)","v":674.33525786510677},"～",{"$f":"(($G70^2+AQ$68^2)^0.5)","v":691.3291835298146},{"$f":"(($E70^2+AR$68^2)^0.5)","v":690.81693667714899},"～",{"$f":"(($G70^2+AT$68^2)^0.5)","v":707.41504083529355},{"$f":"(($E70^2+AU$68^2)^0.5)","v":708.18644437746764},"～",{"$f":"(($G70^2+AW$68^2)^0.5)","v":724.38666470331987},{"$f":"(($E70^2+AX$68^2)^0.5)","v":726.38009333956836},"～",{"$f":"(($G70^2+AZ$68^2)^0.5)","v":742.18329272491712},{"$f":"(($E70^2+BA$68^2)^0.5)","v":745.33753427557906},"～",{"$f":"(($G70^2+BC$68^2)^0.5)","v":760.74702759853096},{"$f":"(($E70^2+BD$68^2)^0.5)","v":765.00198692552431},"～",{"$f":"(($G70^2+BF$68^2)^0.5)","v":780.02310222197912},{"$f":"(($E70^2+BG$68^2)^0.5)","v":785.32034228077907},"～",{"$f":"(($G70^2+BI$68^2)^0.5)","v":799.96002400119971},{"$f":"(($E70^2+BJ$68^2)^0.5)","v":806.24316431210752},"～",{"$f":"(($G70^2+BL$68^2)^0.5)","v":820.50962212517652},{"$f":"(($E70^2+BM$68^2)^0.5)","v":827.72461604086664},"～",{"$f":"(($G70^2+BO$68^2)^0.5)","v":841.62701952824682},{"$f":"(($E70^2+BP$68^2)^0.5)","v":849.72233111764228},"～",{"$f":"(($G70^2+BR$68^2)^0.5)","v":863.27054855358062},{"$f":"(($E70^2+BS$68^2)^0.5)","v":872.19724833319674},"～",{"$f":"(($G70^2+BU$68^2)^0.5)","v":885.40162638206175},{"$f":"(($E70^2+BV$68^2)^0.5)","v":895.113422980574},"～",{"$f":"(($G70^2+BX$68^2)^0.5)","v":907.98460339369194},{"$f":"(($E70^2+BY$68^2)^0.5)","v":918.43782587609053},"～",{"$f":"(($G70^2+CA$68^2)^0.5)","v":930.98659496256982},{"$f":"(($E70^2+CB$68^2)^0.5)","v":942.14013819601166},"～",{"$f":"(($G70^2+CD$68^2)^0.5)","v":954.3773048433203},{"$f":"(($E70^2+CE$68^2)^0.5)","v":966.19254809794518},"～",{"$f":"(($G70^2+CG$68^2)^0.5)","v":978.12884631831605},{"$f":"(($E70^2+CH$68^2)^0.5)","v":990.56955333787641},"～",{"$f":"(($G70^2+CJ$68^2)^0.5)","v":1002.2155656344597},{"$f":"(($E70^2+CK$68^2)^0.5)","v":1015.2477727136367},"～",{"$f":"(($G70^2+CM$68^2)^0.5)","v":1026.6138709368777},{"$f":"(($E70^2+CN$68^2)^0.5)","v":1040.2057681055226},"～",{"$f":"(($G70^2+CP$68^2)^0.5)","v":1051.3020688650813},{"$f":"(($E70^2+CQ$68^2)^0.5)","v":1065.4238780879655},"～",{"$f":"(($G70^2+CS$68^2)^0.5)","v":1076.2602101722428}]
[null,null,300,600,590.20000000000005,640,{"$f":"F71+75*2-79.9*2","v":630.20000000000005},590.96196155082612,"～",630.91365494812362,593.24197423985436,"～",633.04979267037129,597.02264613664363,"～",636.59409359496885,602.27571759120428,"～",641.52321859773713,608.9630859091543,"～",647.80555724692579,617.03811875766644,"～",655.40219712783994,626.44715659024268,"～",664.26804830580261,637.13110110871219,"～",674.35305293295744,649.02699481608624,"～",685.60341306034934,{"$f":"(($E71^2+AI$68^2)^0.5)","v":662.06951296672776},"～",{"$f":"(($G71^2+AK$68^2)^0.5)","v":697.96277837718537},676.19230992373764,"～",711.37334782798825,691.3291835298146,"～",725.77685275847705,707.41504083529355,"～",741.11540261959203,724.38666470331987,"～",757.33218603199487,742.18329272491712,"～",774.37202945354375,760.74702759853096,"～",792.181822563482,780.02310222197912,"～",810.71082390702054,799.96002400119971,"～",829.91086268345714,820.50962212517652,"～",849.73645326065662,841.62701952824682,"～",870.14483851827799,863.27054855358062,"～",891.09597687342296,885.40162638206175,"～",912.55248616175504,907.98460339369194,"～",934.47955568861971,930.98659496256982,"～",956.84483590601042,954.3773048433203,"～",979.61831342620383,978.12884631831605,"～",1002.7721775159101,1002.2155656344597,"～",1026.2806828543544,1026.6138709368777,"～",1050.1200121890831,1051.3020688650813,"～",1074.2681415736017,1076.2602101722428,"～",1098.7047101018545]
[null,null,310,620,610.20000000000005,680,{"$f":"F72+75*2-79.9*2","v":670.2},610.93701803050044,"～",670.87110535482157,613.14275662361047,"～",672.88040542134979,616.80145914224295,"～",676.21597141741631,621.88748178428546,"～",680.85831125132052,628.36616713505509,"～",686.78092576890924,636.19497011529415,"～",693.95103573667211,645.32475545263253,"～",702.33043505176397,655.70118194189649,"～",711.87642185986192,667.26609384862354,"～",722.54275998033506,{"$f":"(($E72^2+AI$68^2)^0.5)","v":679.95885169618907},"～",{"$f":"(($G72^2+AK$68^2)^0.5)","v":734.28062755325368},693.71755059245834,"～",747.03951702704455,708.48009146340871,"～",760.76805926642328,724.18508683899313,"～",775.41475353516455,740.77259668537954,"～",790.92859348995603,758.18470045233698,"～",807.25958650238408,776.36591888103897,"～",824.3591692945497,795.2635035005693,"～",842.18052696556697,814.82761367052353,"～",860.6788251142234,835.01140111976918,"～",879.81136614617571,855.77102077600171,"～",899.53768125632178,877.06558477687406,"～",919.81956926345072,898.85707428934438,"～",940.62109268291454,921.11022141761077,"～",961.90854035090058,943.79237123426674,"～",983.65036471299095,966.87333193133429,"～",1005.8171006698982,990.3252193092934,"～",1028.381271708115,1014.12230031688,"～",1051.317287977326,1038.240839112005,"～",1074.6013400326653,1062.6589481108226,"～",1098.211291145743,1087.356445697546,"～",1122.12657040104]
[null,null,320,640,630.20000000000005,720,710.2,630.91365494812362,"～",710.83334193044152,633.04979267037129,"～",712.72999095028968,636.59409359496885,"～",715.87990612951273,641.52321859773713,"～",720.26664506972702,647.80555724692579,"～",725.86778410396482,655.40219712783994,"～",732.65547155535535,664.26804830580261,"～",740.59708344011187,674.35305293295744,"～",749.65594775203385,685.60341306034934,"～",759.79210314401143,{"$f":"(($E73^2+AI$68^2)^0.5)","v":697.96277837718537},"～",{"$f":"(($G73^2+AK$68^2)^0.5)","v":770.9630600748651},711.37334782798825,"～",783.12453671175444,725.77685275847705,"～",796.23114734353362,741.11540261959203,"～",810.23702704825826,757.33218603199487,"～",825.09638224876494,774.37202945354375,"～",840.76396212016607,792.181822563482,"～",857.19545029123901,810.71082390702054,"～",874.34777977644569,829.91086268345714,"～",892.17937658298297,849.73645326065662,"～",910.65033904347729,870.14483851827799,"～",929.72256076745816,891.09597687342296,"～",949.35980534252667,912.55248616175504,"～",969.52774070678356,934.47955568861971,"～",990.19394059951708,956.84483590601042,"～",1011.3278597962186,979.61831342620383,"～",1032.900789040264,1002.7721775159101,"～",1054.8857947664287,1026.2806828543544,"～",1077.2576479190111,1050.1200121890831,"～",1099.9927454306232,1074.2681415736017,"～",1123.0690272641305,1098.7047101018545,"～",1146.4658913373742]
[null,null,330,660,650.20000000000005,760,750.2,650.89172678718239,"～",750.79960042610571,652.96251040928837,"～",752.59553546377094,656.39929920742611,"～",755.57927446430131,661.18079221949574,"～",759.73682285380903,667.27808296091973,"～",765.04904417952184,674.65549727249686,"～",771.4920868032284,683.27157119259687,"～",779.03789381518538,693.08011080971005,"～",787.65477209244409,704.03127771427887,"～",797.30799569551539,{"$f":"(($E74^2+AI$68^2)^0.5)","v":716.07264994552054},"～",{"$f":"(($G74^2+AK$68^2)^0.5)","v":807.96041982265444},729.15021771922966,"～",819.57308398946338,743.20928411854493,"～",832.10578654399467,758.19525189755711,"～",845.51761661126852,774.05428750185217,"～",859.76743367029201,790.73386167534272,"～",874.81428886364222,808.18317230687251,"～",890.61778558481535,826.35345948328916,"～",907.13837974148134,845.19822527026167,"～",924.33762230042328,864.67337185783629,"～",942.17834829717879,884.73727173664383,"～",960.62481750160919,905.35078284607459,"～",979.64281245768348,926.4772204431149,"～",999.19969975976278,948.08229600599543,"～",1019.2644602849646,970.1340319770253,"～",1039.8076937588028,992.60265967808084,"～",1060.8016025628922,1015.4605063713705,"～",1082.2199591580263,1038.6818762258249,"～",1104.0380609381182,1062.2429289009176,"～",1126.2326757824069,1086.1215585743614,"～",1148.7819810564579,1110.2972755077803,"～",1171.6654983398632]
[null,null,340,680,670.2,800,790.2,670.87110535482157,"～",790.76927102663774,672.88040542134979,"～",792.47463050876274,676.21597141741631,"～",795.30877022701065,680.85831125132052,"～",799.25968245620902,686.78092576890924,"～",804.31091003417328,693.95103573667211,"～",810.44187947069963,702.33043505176397,"～",817.62830185849123,711.87642185986192,"～",825.84262423297093,722.54275998033506,"～",835.05451319060603,734.28062755325368,"～",845.23135294426936,747.03951702704455,"～",856.33874138684166,760.76805926642328,"～",868.34096989604268,775.41475353516455,"～",881.20147525977279,790.92859348995603,"～",894.88325495563947,807.25958650238408,"～",909.3492398413274,824.3591692945497,"～",924.56262091866984,842.18052696556697,"～",940.48712909853271,860.6788251142234,"～",957.08726874825788,879.81136614617571,"～",974.32850722946625,899.53768125632178,"～",992.17742364962123,919.81956926345072,"～",1010.6018206989338,940.62109268291454,"～",1029.5708037818476,961.90854035090058,"～",1049.0548317414109,983.65036471299095,"～",1069.0257433757149,1005.8171006698982,"～",1089.4567637129985,1028.381271708115,"～",1110.3224936927109,1051.317287977326,"～",1131.5988865317959,1074.6013400326653,"～",1153.2632136680681,1098.211291145743,"～",1175.2940227874897,1122.12657040104,"～",1197.6710900743994]
[null,null,350,700,690.2,840,830.2,690.85167727957355,"～",830.7418612300695,692.80303117119809,"～",832.36532844659018,696.0431308475072,"～",835.06409334852856,700.55409498481993,"～",838.82777731784734,706.31157430697681,"～",843.64212791917885,713.28538468133502,"～",849.4892818629321,721.44025393652669,"～",856.34808343336647,730.73664202638702,"～",864.19444571230611,741.13159425300444,"～",873.00174112082959,752.57959047531983,"～",882.74120782933892,765.03335874979985,"～",893.38235935124669,778.44462873090731,"～",904.89338598533254,792.76480749336997,"～",917.24153852733912,807.94556747345302,"～",930.39348664960039,823.93934242758428,"～",944.31564638101815,840.69973236584303,"～",958.97447307006041,858.18182222650228,"～",974.33671797792783,876.34242165947899,"～",990.36964816173565,895.1402348235722,"～",1007.0412305362676,914.53596976827544,"～",1024.320281943104,934.49239697281644,"～",1042.1765877239807,954.97436614811818,"～",1060.5809917210472,975.94878964011218,"～",1079.5054608476976,997.38459984100416,"～",1098.9231274297579,1019.2526870212313,"～",1118.8083124467748,1041.5258230116044,"～",1139.1365326421587,1064.178575240077,"～",1159.8844942493197,1087.187214788695,"～",1181.0300758236431,1110.5296213969261,"～",1202.5523023968647,1134.1851877008446,"～",1224.4313128959093]
[null,null,360,720,710.2,880,870.2,710.83334193044152,"～",870.716968939965,712.72999095028968,"～",872.26603739914117,715.87990612951273,"～",874.84172282762097,720.26664506972702,"～",878.43499474918463,725.86778410396482,"～",883.03343085072379,732.65547155535535,"～",888.62142670543346,740.59708344011187,"～",895.18045108235026,749.65594775203385,"～",902.68933747995493,759.79210314401143,"～",911.12460179714174,770.9630600748651,"～",920.46077591606263,783.12453671175444,"～",930.67074736450161,796.23114734353362,"～",941.72609605978323,810.23702704825826,"～",953.59742029852407,825.09638224876494,"～",966.25464552570202,840.76396212016607,"～",979.66731087650362,857.19545029123901,"～",993.80482993392627,874.34777977644569,"～",1008.6367235035615,892.17937658298297,"～",1024.1328234169628,910.65033904347729,"～",1040.2634474016666,929.72256076745816,"～",1056.9995458844814,949.35980534252667,"～",1074.3128222263756,969.52774070678356,"～",1092.1758283353463,990.19394059951708,"～",1110.5620378889241,1011.3278597962186,"～",1129.4458995454363,1032.900789040264,"～",1148.8028725590827,1054.8857947664287,"～",1168.6094471635936,1077.2576479190111,"～",1188.8431519759031,1099.9927454306232,"～",1209.4825505148885,1123.0690272641305,"～",1230.50722874756,1146.4658913373742,"～",1251.8977753794436]
[null,null,370,740,730.2,920,910.2,730.81600967685438,"～",910.69426263702792,732.66093112708018,"～",912.17544365105562,735.72551947040688,"～",914.63874835915408,739.99462160207622,"～",918.07627134133031,745.44754342609519,"～",922.4771216675241,752.05853495589031,"～",927.82759174320745,759.79736772378988,"～",934.111363810547,768.62997599625271,"～",941.30974710772011,778.51913271287049,"～",949.40193806416892,789.4251326123333,"～",958.36529569887909,801.30645822930944,"～",968.17562456405608,814.12040878484311,"～",978.80745808355994,827.82367687811393,"～",990.23433590236607,842.37286281076274,"～",1002.4290698099293,857.72492093910853,"～",1015.3639938465417,873.83753638762857,"～",1029.011195274376,890.66943362843665,"～",1043.3427241323918,908.18062080183154,"～",1058.3307800494135,926.33257526657246,"～",1073.9478758301075,945.0883768198612,"～",1090.1669780359337,964.41279543564747,"～",1106.9616253511231,984.27234036114214,"～",1124.3060259555671,1004.6352771030888,"～",1142.1751354323908,1025.4716183298297,"～",1160.5447169325273,1046.7530940962151,"～",1179.3913854187676,1068.4531061305404,"～",1198.6926378350706,1090.5466702530434,"～",1218.4268710103204,1113.0103503561861,"～",1238.5733890246472,1135.8221867880554,"～",1259.1124016544354,1158.9616214525829,"～",1280.0250153805589]
[null,null,380,760,750.2,960,950.2,750.79960042610571,"～",950.67346654884614,752.59553546377094,"～",952.09245349388209,755.57927446430131,"～",954.45274372281006,759.73682285380903,"～",957.74737796560953,765.04904417952184,"～",961.96675618235372,771.4920868032284,"～",967.09877468643299,779.03789381518538,"～",973.12899453258512,787.65477209244409,"～",980.04083588389312,797.30799569551539,"～",987.81579254433871,807.96041982265444,"～",996.43366061168365,819.57308398946338,"～",1005.8727752553998,832.10578654399467,"～",1016.110249923698,845.51761661126852,"～",1027.1222127867745,859.76743367029201,"～",1038.8840358769596,874.81428886364222,"～",1051.3705531352873,890.61778558481535,"～",1064.5562643655805,907.13837974148134,"～",1078.4155228853117,924.33762230042328,"～",1092.9227054096734,942.17834829717879,"～",1108.0523633836083,960.62481750160919,"～",1123.779355567631,979.64281245768348,"～",1140.0789621776205,999.19969975976278,"～",1156.9269812740993,1019.2644602849646,"～",1174.299808396476,1039.8076937588028,"～",1192.1745006499677,1060.8016025628922,"～",1210.5288265877853,1082.2199591580263,"～",1229.3413033002673,1104.0380609381182,"～",1248.5912221379742,1126.2326757824069,"～",1268.2586644687274,1148.7819810564579,"～",1288.3245088097951,1171.6654983398632,"～",1308.7704305950681]
[null,null,390,780,770.2,1000,990.2,770.78404238800897,"～",990.65434940750151,772.53352030834242,"～",992.01614906210068,775.44054575447626,"～",994.28167035302431,779.49216801710077,"～",997.44475536242112,784.67065702752006,"～",1001.4968996457253,790.95387981853912,"～",1006.4273644928381,798.31575206806485,"～",1012.2233152817613,806.72674431928931,"～",1018.8699818917034,816.15442166295963,"～",1026.3508367025381,826.56399631244528,"～",1034.6477854806437,837.918874354791,"～",1043.7413664313588,850.18118069032789,"～",1053.6109528663794,863.31224942079905,"～",1064.23495526129,877.27307037204787,"～",1075.5910189286633,892.0246857570703,"～",1087.6562140676622,907.5285339866731,"～",1100.4072155343222,923.74674018369342,"～",1113.820470273374,940.64235498939763,"～",1127.8723509333847,958.17954476183638,"～",1142.5392947290698,976.32373729209314,"～",1157.7979271012709,995.04172776823793,"～",1173.6251701459032,1014.3017499738429,"～",1189.9983361332906,1034.0735176959131,"～",1206.8952067184623,1054.3282411090011,"～",1224.2940986544043,1075.0386225619989,"～",1242.1739169697616,1096.1788357745281,"～",1260.5141966673759,1117.7244919925483,"～",1279.2951340484337,1139.6525961888563,"～",1298.497608777159,1161.9414959454714,"～",1318.1031977808111,1184.5708252358743,"～",1338.0941820365263]
[null,null,400,800,790.2,1040,1030.2,790.76927102663774,"～",1030.6367158218263,792.47463050876274,"～",1031.9457543882818,795.30877022701065,"～",1034.1238030332731,799.25968245620902,"～",1037.1653870044063,804.31091003417328,"～",1041.0629375787037,810.44187947069963,"～",1045.8068846589222,817.62830185849123,"～",1051.3857712562026,825.84262423297093,"～",1057.7863867530154,835.05451319060603,"～",1064.9939154755768,845.23135294426936,"～",1072.9920968954059,856.33874138684166,"～",1081.763393723415,868.34096989604268,"～",1091.2891642456641,881.20147525977279,"～",1101.5498354591134,894.88325495563947,"～",1112.525073874742,909.3492398413274,"～",1124.1939512379527,924.56262091866984,"～",1136.5351028454863,940.48712909853271,"～",1149.526876588799,957.08726874825788,"～",1163.1474713036177,974.32850722946625,"～",1177.3750634356072,992.17742364962123,"～",1192.187921428497,1010.6018206989338,"～",1207.5645075936936,1029.5708037818476,"～",1223.4835675234874,1049.0548317414109,"～",1239.924207361079,1069.0257433757149,"～",1256.8659594403853,1089.4567637129985,"～",1274.288836959659,1110.3224936927109,"～",1292.1733784597175,1131.5988865317959,"～",1310.5006829452627,1153.2632136680681,"～",1329.2524365221227,1175.2940227874897,"～",1348.4109314300297,1197.6710900743994,"～",1367.9590783353133]
[null,null,410,{"$f":"C82*2","v":820},810.2,1080,{"$f":"F82+75*2-79.9*2","v":1070.2},810.75522816692342,"～",1070.6203995814762,812.41863592608468,"～",1071.8806090232251,815.18343947850167,"～",1073.9776720211646,819.03848505427391,"～",1076.9066997655832,823.96847027055594,"～",1080.6609273958229,829.95423970240677,"～",1085.2317909092048,836.97314174350902,"～",1090.6090225190694,844.99943195247181,"～",1096.7807620486421,854.00470724698005,"～",1103.7336816460754,{"$f":"(($E82^2+AI$68^2)^0.5)","v":863.95835547785521},"～",{"$f":"(($G82^2+AK$68^2)^0.5)","v":1111.4531209187367},874.82800595317019,"～",1119.9232295117376,886.57996819237917,"～",1129.1271141904263,899.17964834620227,"～",1139.0469876172799,912.59193509476074,"～",1149.664316224523,926.78154923369084,"～",1160.9599648566698,941.71335341493386,"～",1172.9143361729364,957.3526205113767,"～",1185.5075031394783,973.66526075443403,"～",1198.7193332886561,990.61800912359752,"～",1212.5296037623164,1008.1785754517897,"～",1226.9181064765489,1026.3157603778673,"～",1241.8647430376627,1044.9995406697556,"～",1257.3496092972709,1064.2011276069952,"～",1273.353069655074,1083.8930020993769,"～",1289.855821400206,1104.0489300751121,"～",1306.8389495266813,1124.6439614384635,"～",1324.2839725678175,1145.65441560708,"～",1342.1728800717142,1167.0578563207566,"～",1360.4881623887802,1188.8330580867946,"～",1379.2128334669744,1210.9599663077224,"～",1398.3304473549877]
[null,null,420,840,830.2,1120,1110.2,830.7418612300695,"～",1110.6052584064241,832.36532844659018,"～",1111.8201473259962,835.06409334852856,"～",1113.8420175231315,838.82777731784734,"～",1116.6664855721247,843.64212791917885,"～",1120.2874809619182,849.4892818629321,"～",1124.6973103906669,856.34808343336647,"～",1129.8867376865701,864.19444571230611,"～",1135.845077464352,873.00174112082959,"～",1142.5603003780589,{"$f":"(($E83^2+AI$68^2)^0.5)","v":882.74120782933892},"～",{"$f":"(($G83^2+AK$68^2)^0.5)","v":1150.0191476666812},893.38235935124669,"～",1158.2072526106888,904.89338598533254,"～",1167.1092665213484,917.24153852733912,"～",1176.7089869632168,930.39348664960039,"～",1186.9894860528461,944.31564638101815,"～",1197.9332368709033,958.97447307006041,"～",1209.5222362569446,974.33671797792783,"～",1221.7381225123493,990.36964816173565,"～",1234.5622868045177,1007.0412305362676,"～",1247.9759773328972,1024.320281943104,"～",1261.9603955750752,1042.1765877239807,"～",1276.496784171429,1060.5809917210472,"～",1291.5665062241278,1079.5054608476976,"～",1307.1511159770318,1098.9231274297579,"～",1323.232421005471,1118.8083124467748,"～",1339.7925361786429,1139.1365326421587,"～",1356.8139297633998,1159.8844942493197,"～",1374.2794621182404,1181.0300758236431,"～",1392.1724174828346,1202.5523023968647,"～",1410.4765294041586,1224.4313128959093,"～",1429.1760003582483]
[null,null,430,860,850.2,1160,1150.2,850.72912257662836,"～",1150.591169790556,852.31451941170167,"～",1151.76388205222,854.9503143458104,"～",1153.7157535545746,858.62683396222837,"～",1156.4428390543133,863.33078249301411,"～",1159.939670844997,869.04547637048313,"～",1164.1993128326437,875.75112903153035,"～",1169.2134279078393,883.42517509973652,"～",1174.9723571216473,892.04262230007828,"～",1181.4652089672384,{"$f":"(($E84^2+AI$68^2)^0.5)","v":901.57641938994834},"～",{"$f":"(($G84^2+AK$68^2)^0.5)","v":1188.6799569270106},911.99782894478426,"～",1196.6035433676436,923.27679489955779,"～",1205.2219878512008,935.38229617627462,"～",1214.5204979744065,948.28267937361386,"～",1224.4835809434114,961.94596521842118,"～",1235.0951542290172,976.34012516130872,"～",1246.3386538176533,991.43332604870614,"～",1258.1971387664178,1007.1941421592959,"～",1270.6533909764692,1023.5917350193876,"～",1283.690009309101,1040.5960022986826,"～",1297.2894973752004,1058.1776977426807,"～",1311.4343445251081,1076.3085245411744,"～",1326.1070997472264,1094.9612047922064,"～",1341.2904383465946,1114.1095278292885,"～",1356.9672214169361,1133.7283801687245,"～",1373.1205482403939,1153.7937597335149,"～",1389.7338018483972,1174.2827768472123,"～",1406.7906880556184,1195.1736442877245,"～",1424.2752683382521,1216.4456584656793,"～",1442.171986969654,1238.0791735587834,"～",1460.4656928527968]
[null,null,440,880,870.2,1200,1190.2,870.716968939965,"～",1190.5780276823523,872.26603739914117,"～",1191.7113912353109,874.84172282762097,"～",1193.5979390062635,878.43499474918463,"～",1196.2341075224365,883.03343085072379,"～",1199.614954891777,888.62142670543346,"～",1203.7342065422915,895.18045108235026,"～",1208.5843123257889,902.68933747995493,"～",1214.156513798777,911.12460179714174,"～",1220.4409203234707,920.46077591606263,"～",1227.4265925097109,930.67074736450161,"～",1235.101631445769,941.72609605978323,"～",1243.4532721417399,953.59742029852407,"～",1252.4679796306173,966.25464552570202,"～",1262.1315462343853,979.66731087650362,"～",1272.4291885995071,993.80482993392627,"～",1283.3456432310043,1008.6367235035615,"～",1294.8652593996026,1024.1328234169628,"～",1306.9720884548376,1040.2634474016666,"～",1319.6499687417115,1056.9995458844814,"～",1332.8826054833187,1074.3128222263756,"～",1346.653645151566,1092.1758283353463,"～",1360.9467439984564,1110.5620378889241,"～",1375.7456305582075,1129.4458995454363,"～",1391.0341620535421,1148.8028725590827,"～",1406.7963747465374,1168.6094471635936,"～",1423.0165283650081,1188.8431519759031,"～",1439.6791448097038,1209.4825505148885,"～",1456.7690414063584,1230.50722874756,"～",1474.2713590109522,1251.8977753794436,"～",1492.1715853078024]
[null,null,450,900,890.2,1240,1230.2,890.70536093592705,"～",1230.565739812384,892.21972630064624,"～",1231.6623076152002,894.73797281662303,"～",1233.487754296734,898.25165738783915,"～",1236.0388505221024,902.74915674289059,"～",1239.3111150958018,908.21585540002548,"～",1243.2988538561435,914.63437503736975,"～",1247.9952083241346,921.98483718551472,"～",1253.3922131559618,930.24515048453759,"～",1259.4808613075468,939.39131356426753,"～",1266.2511757151501,949.39772487614482,"～",1273.6922862292918,960.2374914571916,"～",1281.792510510184,971.88272955125615,"～",1290.5394375996418,984.30485115130875,"～",1299.9200129238723,997.47483176268668,"～",1309.9206235493814,1011.3634559346111,"～",1320.5271826054927,1025.9415382954332,"～",1331.7252118962081,1041.180118903545,"～",1343.4999218459225,1057.0506326567333,"～",1355.8362880525067,1073.5250532707655,"～",1368.7191238526625,1090.5760129399509,"～",1382.1331484339705,1108.1768992358575,"～",1396.0630501521055,1126.3019311001824,"～",1410.4935448274834,1144.9262159632822,"～",1425.4094289010438,1164.0257900922986,"～",1440.795627422571,1183.577644263358,"～",1456.6372369262019,1203.5597367808546,"～",1472.9195633163408,1223.9509957510554,"～",1489.6281549433738,1244.7313123722727,"～",1506.7488310929596,1265.881526842066,"～",1524.267706146135]
[null,null,460,920,910.2,1280,1270.2,910.69426263702792,"～",1270.5542255252233,912.17544365105562,"～",1271.6163100558281,914.63874835915408,"～",1273.3844823932793,918.07627134133031,"～",1275.8558068998236,922.4771216675241,"～",1279.0262077064724,927.82759174320745,"～",1282.8905019525243,934.111363810547,"～",1287.4424414318491,941.30974710772011,"～",1292.6747618794141,949.40193806416892,"～",1298.579239014701,958.36529569887909,"～",1305.1467503694748,968.17562456405608,"～",1312.36734186736,978.80745808355994,"～",1320.2302980919656,990.23433590236607,"～",1328.7242151778526,1002.4290698099293,"～",1337.837075282338,1015.3639938465417,"～",1347.5563216429955,1029.011195274376,"～",1357.8689332921642,1043.3427241323918,"～",1368.7614985818384,1058.3307800494135,"～",1380.2202867658482,1073.9478758301075,"～",1392.2313169872311,1090.1669780359337,"～",1404.7804241232864,1106.9616253511231,"～",1417.8533210455869,1124.3060259555671,"～",1431.4356569542342,1142.1751354323908,"～",1445.5130715424195,1160.5447169325273,"～",1460.0712448370457,1179.3913854187676,"～",1475.095942642376,1198.6926378350706,"～",1490.5730575855716,1218.4268710103204,"～",1506.4886458251187,1238.5733890246472,"～",1522.8289595355086,1259.1124016544354,"～",1539.5804753243658,1280.0250153805589,"～",1556.7299187720394]
[null,null,470,940,930.2,1320,1310.2,930.68364120145577,"～",1310.5434140080977,932.13305917127525,"～",1311.5731165283923,934.54376034512154,"～",1313.2874932778427,937.90833240781058,"～",1315.6838678041165,942.21655684879579,"～",1318.7585222473447,947.45556096315147,"～",1322.5067258808176,953.61000414215459,"～",1326.9227709252714,960.66229237958544,"～",1332.0000150150149,968.59281434460377,"～",1337.7309295968305,977.38019214633152,"～",1344.107153466568,987.00154001906196,"～",1351.1195505949872,997.43272454837779,"～",1358.7582713639686,1008.6486206801653,"～",1367.0128163261675,1020.6233585412398,"～",1375.8721016140998,1033.3305569855177,"～",1385.3245251564704,1046.7435407013506,"～",1395.3580329076835,1060.8355386203839,"～",1405.9601843580067,1075.5798622138666,"～",1417.1182166636629,1090.9500630184684,"～",1428.819106815135,1106.9200693817056,"～",1441.0496313451526,1123.4643029486963,"～",1453.7964231624728,1140.5577758272484,"～",1467.0460251812142,1158.1761696736814,"～",1480.7849404960871,1176.2958981480808,"～",1494.9996789297313,1194.8941543082383,"～",1509.6767998482323,1213.9489445606846,"～",1524.8029512038597,1233.4391107792878,"～",1540.3649048196339,1253.3443421502329,"～",1556.3495879782281,1273.6451782188005,"～",1572.7441114180017,1294.3230045085345,"～",1589.5357938719089]
[null,null,480,960,950.2,1360,1350.2,950.67346654884614,"～",1350.5332428341037,952.09245349388209,"～",1351.5324783370913,954.45274372281006,"～",1353.1962311505306,957.74737796560953,"～",1355.5220544129852,961.96675618235372,"～",1358.5065476470845,967.09877468643299,"～",1362.1453813745434,973.12899453258512,"～",1366.4333280478781,980.04083588389312,"～",1371.3642987915355,987.81579254433871,"～",1376.9313853638459,996.43366061168365,"～",1383.12690668644,1005.8727752553998,"～",1389.9424592406695,1016.110249923698,"～",1397.3689706015373,1027.1222127867745,"～",1405.3967553683906,1038.8840358769596,"～",1414.0155727572451,1051.3705531352873,"～",1423.2146851406501,1064.5562643655805,"～",1432.9829168556057,1078.4155228853117,"～",1443.3087126460507,1092.9227054096734,"～",1454.1801951615212,1108.0523633836083,"～",1465.5852209953539,1123.779355567631,"～",1477.5114348119273,1140.0789621776205,"～",1489.9463211807331,1156.9269812740993,"～",1502.8772538035166,1174.299808396476,"～",1516.2915418876412,1192.1745006499677,"～",1530.1764734827157,1210.5288265877853,"～",1544.5193556572867,1229.3413033002673,"～",1559.3075514471159,1248.5912221379742,"～",1574.5285135557247,1268.2586644687274,"～",1590.1698148311079,1288.3245088097951,"～",1606.2191755797214,1308.7704305950681,"～",1622.6644878100956]
[null,null,490,980,970.2,1400,1390.2,970.66371107608632,"～",1390.523656756691,972.05351704522934,"～",1391.4941753381506,974.36545505267168,"～",1393.1102038245215,977.59298278987251,"～",1395.3694994516686,981.72707001487947,"～",1398.2689440876529,986.75632250318017,"～",1401.8045655511328,992.66713454208809,"～",1405.9715644350706,999.44386535712954,"～",1410.7643460195611,1007.069034376492,"～",1416.1765567894422,1015.5235300080446,"～",1422.2011250171333,1024.786826613223,"～",1428.8303048297932,1034.8372045882386,"～",1436.055723152831,1045.6519688691835,"～",1443.8684289089501,1057.2076617202506,"～",1452.258943852645,1069.4802662976069,"～",1461.2173144334145,1082.4453981610343,"～",1470.7331641055764,1096.0784825914611,"～",1480.795745536838,1110.3549162317427,"～",1491.3939922099726,1125.2502121750522,"～",1502.5165689602229,1140.7401281624136,"～",1514.151921043592,1156.8007780080372,"～",1526.2883213862315,1173.4087267444368,"～",1538.9139157210841,1190.5410702701524,"～",1552.0167653733643,1208.1755004965132,"～",1565.584887510096,1226.290357134068,"～",1579.6062927198029,1244.8646673434025,"～",1594.0690198357158,1263.87817450892,"～",1608.9611679590032,1283.3113573875983,"～",1624.2709256771175,1303.1454408468765,"～",1639.9865975062114,1323.3623993449414,"～",1656.0966276156714]
[null,null,500,{"$f":"C91*2","v":1000},990.2,1440,1430.2,990.65434940750151,"～",1430.5146067062719,992.01614906210068,"～",1431.4580119584368,994.28167035302431,"～",1433.0289738871297,997.44475536242112,"～",1435.225431770215,1001.4968996457253,"～",1438.0445194777524,1006.4273644928381,"～",1441.4825840085616,1012.2233152817613,"～",1445.5352088413481,1018.8699818917034,"～",1450.1972417571342,1026.3508367025381,"～",1455.4628267324454,1034.6477854806437,"～",1461.3254394555649,1043.7413664313588,"～",1467.7779259819927,1053.6109528663794,"～",1474.8125440204258,1064.23495526129,"～",1482.4210063271501,1075.5910189286633,"～",1490.594525684299,"～","～","～",1100.4072155343222,"～",1508.5993636482815,1113.820470273374,"～",1518.4110247228843,1127.8723509333847,"～",1528.7485208496523,1142.5392947290698,"～",1539.6012600670344,1157.7979271012709,"～",1550.9584262642245,1173.6251701459032,"～",1562.8090222416813,1189.9983361332906,"～",1575.1419110670631,1206.8952067184623,"～",1587.9458555001174,1224.2940986544043,"～",1601.2095553049887,1242.1739169697616,"～",1614.9216823115603,1260.5141966673759,"～",1629.0709131280935,1279.2951340484337,"～",1643.6459594450382,1298.497608777159,"～",1658.6355959040552,1318.1031977808111,"～",1674.0286855367801,1338.0941820365263,"～",1689.8142028045568]
[]
[null,"【３段飛ばして連結】"]
[]
[]
[]
[]
[]
[]
[]
[]
[]
[]
[null,null,null,null,null,null,null,null,null,null,null,null,null,null,null,null,null,null,null,null,null,null,null,null,null,null,null,null,null,null,null,null,null,null,"蹴上"]
[null,null,null,"最小",null,"最大",null,10,null,null,20,null,null,30,null,null,40,null,null,50,null,null,60,null,null,70,null,null,80,null,null,90,null,null,100,null,null,110,null,null,120,null,null,130,null,null,140,null,null,150,null,null,160,null,null,170,null,null,180,null,null,190,null,null,200,null,null,210,null,null,220,null,null,230,null,null,240,null,null,250,null,null,260,null,null,270,null,null,280,null,null,290,null,null,300]
[null,null,null,"⑥","③","⑥","③",{"$f":"H105*4","v":40},null,{"$f":"H105*4","v":40},{"$f":"K105*4","v":80},null,{"$f":"K105*4","v":80},{"$f":"N105*4","v":120},null,{"$f":"N105*4","v":120},{"$f":"Q105*4","v":160},null,{"$f":"Q105*4","v":160},{"$f":"T105*4","v":200},null,{"$f":"T105*4","v":200},{"$f":"W105*4","v":240},null,{"$f":"W105*4","v":240},{"$f":"Z105*4","v":280},null,{"$f":"Z105*4","v":280},{"$f":"AC105*4","v":320},null,{"$f":"AC105*4","v":320},{"$f":"AF105*4","v":360},null,{"$f":"AF105*4","v":360},{"$f":"AI105*4","v":400},null,{"$f":"AI106","v":400},{"$f":"AL105*4","v":440},null,{"$f":"AL106","v":440},{"$f":"AO105*4","v":480},null,{"$f":"AO106","v":480},{"$f":"AR105*4","v":520},null,{"$f":"AR106","v":520},{"$f":"AU105*4","v":560},null,{"$f":"AU106","v":560},{"$f":"AX105*4","v":600},null,{"$f":"AX106","v":600},{"$f":"BA105*4","v":640},null,{"$f":"BA106","v":640},{"$f":"BD105*4","v":680},null,{"$f":"BD106","v":680},{"$f":"BG105*4","v":720},null,{"$f":"BG106","v":720},{"$f":"BJ105*4","v":760},null,{"$f":"BJ106","v":760},{"$f":"BM105*4","v":800},null,{"$f":"BM106","v":800},{"$f":"BP105*4","v":840},null,{"$f":"BP106","v":840},{"$f":"BS105*4","v":880},null,{"$f":"BS106","v":880},{"$f":"BV105*4","v":920},null,{"$f":"BV106","v":920},{"$f":"BY105*4","v":960},null,{"$f":"BY106","v":960},{"$f":"CB105*4","v":1000},null,{"$f":"CB106","v":1000},{"$f":"CE105*4","v":1040},null,{"$f":"CE106","v":1040},{"$f":"CH105*4","v":1080},null,{"$f":"CH106","v":1080},{"$f":"CK105*4","v":1120},null,{"$f":"CK106","v":1120},{"$f":"CN105*4","v":1160},null,{"$f":"CN106","v":1160},{"$f":"CQ105*4","v":1200},null,{"$f":"CQ106","v":1200}]
[null,"踏面",280,{"$f":"C107*3","v":840},{"$f":"E69+C107","v":830.2},{"$f":"F69+C107","v":840},{"$f":"F107+75*2-79.9*2","v":830.2},{"$f":"(($E107^2+H$106^2)^0.5)","v":831.16306462691182},"～",{"$f":"(($G107^2+J$106^2)^0.5)","v":831.16306462691182},{"$f":"(($E107^2+K$106^2)^0.5)","v":834.04558628410712},"～",{"$f":"(($G107^2+M$106^2)^0.5)","v":834.04558628410712},{"$f":"(($E107^2+N$106^2)^0.5)","v":838.82777731784734},"～",{"$f":"(($G107^2+P$106^2)^0.5)","v":838.82777731784734},{"$f":"(($E107^2+Q$106^2)^0.5)","v":845.47740360106616},"～",{"$f":"(($G107^2+S$106^2)^0.5)","v":845.47740360106616},{"$f":"(($E107^2+T$106^2)^0.5)","v":853.95084167649838},"～",{"$f":"(($G107^2+V$106^2)^0.5)","v":853.95084167649838},{"$f":"(($E107^2+W$106^2)^0.5)","v":864.19444571230611},"～",{"$f":"(($G107^2+Y$106^2)^0.5)","v":864.19444571230611},{"$f":"(($E107^2+Z$106^2)^0.5)","v":876.14612936427454},"～",{"$f":"(($G107^2+AB$106^2)^0.5)","v":876.14612936427454},{"$f":"(($E107^2+AC$106^2)^0.5)","v":889.73706228300955},"～",{"$f":"(($G107^2+AE$106^2)^0.5)","v":889.73706228300955},{"$f":"(($E107^2+AF$106^2)^0.5)","v":904.89338598533254},"～",{"$f":"(($G107^2+AH$106^2)^0.5)","v":904.89338598533254},{"$f":"(($E107^2+AI$106^2)^0.5)","v":921.53786682913903},"～",{"$f":"(($G107^2+AK$106^2)^0.5)","v":921.53786682913903},{"$f":"(($E107^2+AL$106^2)^0.5)","v":939.59142184249424},"～",{"$f":"(($G107^2+AN$106^2)^0.5)","v":939.59142184249424},{"$f":"(($E107^2+AO$106^2)^0.5)","v":958.97447307006041},"～",{"$f":"(($G107^2+AQ$106^2)^0.5)","v":958.97447307006041},{"$f":"(($E107^2+AR$106^2)^0.5)","v":979.60810531559002},"～",{"$f":"(($G107^2+AT$106^2)^0.5)","v":979.60810531559002},{"$f":"(($E107^2+AU$106^2)^0.5)","v":1001.4150188608118},"～",{"$f":"(($G107^2+AW$106^2)^0.5)","v":1001.4150188608118},{"$f":"(($E107^2+AX$106^2)^0.5)","v":1024.320281943104},"～",{"$f":"(($G107^2+AZ$106^2)^0.5)","v":1024.320281943104},{"$f":"(($E107^2+BA$106^2)^0.5)","v":1048.2518972079183},"～",{"$f":"(($G107^2+BC$106^2)^0.5)","v":1048.2518972079183},{"$f":"(($E107^2+BD$106^2)^0.5)","v":1073.1412022655732},"～",{"$f":"(($G107^2+BF$106^2)^0.5)","v":1073.1412022655732},{"$f":"(($E107^2+BG$106^2)^0.5)","v":1098.9231274297579},"～",{"$f":"(($G107^2+BI$106^2)^0.5)","v":1098.9231274297579},{"$f":"(($E107^2+BJ$106^2)^0.5)","v":1125.5363343757499},"～",{"$f":"(($G107^2+BL$106^2)^0.5)","v":1125.5363343757499},{"$f":"(($E107^2+BM$106^2)^0.5)","v":1152.923258504225},"～",{"$f":"(($G107^2+BO$106^2)^0.5)","v":1152.923258504225},{"$f":"(($E107^2+BP$106^2)^0.5)","v":1181.0300758236431},"～",{"$f":"(($G107^2+BR$106^2)^0.5)","v":1181.0300758236431},{"$f":"(($E107^2+BS$106^2)^0.5)","v":1209.8066126451781},"～",{"$f":"(($G107^2+BU$106^2)^0.5)","v":1209.8066126451781},{"$f":"(($E107^2+BV$106^2)^0.5)","v":1239.2062136706706},"～",{"$f":"(($G107^2+BX$106^2)^0.5)","v":1239.2062136706706},{"$f":"(($E107^2+BY$106^2)^0.5)","v":1269.1855813867412},"～",{"$f":"(($G107^2+CA$106^2)^0.5)","v":1269.1855813867412},{"$f":"(($E107^2+CB$106^2)^0.5)","v":1299.7045972066114},"～",{"$f":"(($G107^2+CD$106^2)^0.5)","v":1299.7045972066114},{"$f":"(($E107^2+CE$106^2)^0.5)","v":1330.726132605804},"～",{"$f":"(($G107^2+CG$106^2)^0.5)","v":1330.726132605804},{"$f":"(($E107^2+CH$106^2)^0.5)","v":1362.2158566101043},"～",{"$f":"(($G107^2+CJ$106^2)^0.5)","v":1362.2158566101043},{"$f":"(($E107^2+CK$106^2)^0.5)","v":1394.1420444129787},"～",{"$f":"(($G107^2+CM$106^2)^0.5)","v":1394.1420444129787},{"$f":"(($E107^2+CN$106^2)^0.5)","v":1426.4753906044086},"～",{"$f":"(($G107^2+CP$106^2)^0.5)","v":1426.4753906044086},{"$f":"(($E107^2+CQ$106^2)^0.5)","v":1459.1888294528574},"～",{"$f":"(($G107^2+CS$106^2)^0.5)","v":1459.1888294528574}]
[null,null,290,{"$f":"C108*3","v":870},860.2,890,{"$f":"F108+75*2-79.9*2","v":880.2},{"$f":"(($E108^2+H$106^2)^0.5)","v":861.12951406858656},"～",{"$f":"(($G108^2+J$106^2)^0.5)","v":881.1084155766531},{"$f":"(($E108^2+K$106^2)^0.5)","v":863.91205570937598},"～",{"$f":"(($G108^2+M$106^2)^0.5)","v":883.82806020175667},{"$f":"(($E108^2+N$106^2)^0.5)","v":868.52981526255041},"～",{"$f":"(($G108^2+P$106^2)^0.5)","v":888.3422988915928},{"$f":"(($E108^2+Q$106^2)^0.5)","v":874.95373591979137},"～",{"$f":"(($G108^2+S$106^2)^0.5)","v":894.62396569732027},883.14440495311976,"～",902.63616147371363,893.05321230036452,"～",912.33329436122199,904.62370077286835,"～",923.66229759582586,917.79302677673468,"～",936.56395403624197,932.49345306012742,"～",950.97425832669103,{"$f":"(($E108^2+AI$106^2)^0.5)","v":948.65380408239548},"～",{"$f":"(($G108^2+AK$106^2)^0.5)","v":966.82575472522456},{"$f":"(($E108^2+AL$106^2)^0.5)","v":966.2008279855695},"～",{"$f":"(($G108^2+AN$106^2)^0.5)","v":984.04879960294659},{"$f":"(($E108^2+AO$106^2)^0.5)","v":985.06042454257602},"～",{"$f":"(($G108^2+AQ$106^2)^0.5)","v":1002.5727105801354},{"$f":"(($E108^2+AR$106^2)^0.5)","v":1005.1587138357803},"～",{"$f":"(($G108^2+AT$106^2)^0.5)","v":1022.3267775031621},{"$f":"(($E108^2+AU$106^2)^0.5)","v":1026.4229342722228},"～",{"$f":"(($G108^2+AW$106^2)^0.5)","v":1043.2411226557358},1048.7821699476017,"～",1065.2474078823191,1072.1679159534667,"～",1088.279394273364,1096.5144960282103,"～",1112.2733656794987,1121.7593503064729,"～",1137.1684307964233,1147.8432122899017,"～",1162.906720248877,1174.7101940478767,"～",1189.4334954086337,1202.3077975294013,"～",1216.6971850053735,1230.586868124311,"～",1244.6493642789524,1259.501504564405,"～",1273.2446897591994,1289.0089371296074,"～",1302.4408009579552,1319.0693840734839,"～",1332.1981984674803,1349.6458942996862,"～",1362.4801062767854,1380.7041826546338,"～",1393.2523245988143,1412.2124627689702,"～",1424.48307817257,1444.1412811771568,"～",1456.142863870163,1476.4633554545132,"～",1488.2043004910313]
[null,null,300,900,890.2,940,{"$f":"F109+75*2-79.9*2","v":930.2},{"$f":"(($E109^2+H$106^2)^0.5)","v":891.09822129774227},"～",{"$f":"(($G109^2+J$106^2)^0.5)","v":931.05963289147064},{"$f":"(($E109^2+K$106^2)^0.5)","v":893.7874691446508},"～",{"$f":"(($G109^2+M$106^2)^0.5)","v":933.63378259358205},{"$f":"(($E109^2+N$106^2)^0.5)","v":898.25165738783915},"～",{"$f":"(($G109^2+P$106^2)^0.5)","v":937.90833240781058},{"$f":"(($E109^2+Q$106^2)^0.5)","v":904.46450455504339},"～",{"$f":"(($G109^2+S$106^2)^0.5)","v":943.86018032333584},912.39028929510209,"～",951.45784982835687,921.98483718551472,"～",960.66229237958544,933.19667809095847,"～",971.42783571400719,945.96830813722295,"～",983.70322760474869,960.2374914571916,"～",997.43272454837779,{"$f":"(($E109^2+AI$106^2)^0.5)","v":975.93854314705698},"～",{"$f":"(($G109^2+AK$106^2)^0.5)","v":1012.557178632397},{"$f":"(($E109^2+AL$106^2)^0.5)","v":993.00354480736883},"～",{"$f":"(($G109^2+AN$106^2)^0.5)","v":1029.0150824939351},{"$f":"(($E109^2+AO$106^2)^0.5)","v":1011.3634559346111},"～",{"$f":"(($G109^2+AQ$106^2)^0.5)","v":1046.7435407013506},{"$f":"(($E109^2+AR$106^2)^0.5)","v":1030.9490967065251},"～",{"$f":"(($G109^2+AT$106^2)^0.5)","v":1065.6791449587442},{"$f":"(($E109^2+AU$106^2)^0.5)","v":1051.6919891298974},"～",{"$f":"(($G109^2+AW$106^2)^0.5)","v":1085.7587393155075},1073.5250532707655,"～",1106.9200693817056,1096.3831629498877,"～",1129.1023160015216,1120.203570785239,"～",1152.2465187623698,1144.9262159632822,"～",1176.2958981480808,1170.4939299287289,"～",1201.1960872397146,1196.8525556642305,"～",1226.8952848552317,1223.9509957510554,"～",1253.3443421502329,1251.7412032844488,"～",1280.4967942169944,1280.178128230599,"～",1308.3088473292535,1309.2196301614179,"～",1336.7393313582122,1338.8263666360922,"～",1365.7496256635036,1368.9616649124985,"～",1395.3035655369049,1399.5913832258327,"～",1425.3673351104972,1430.6837665955395,"～",1455.9093515737852,1462.2093010236258,"～",1486.9001445961326,1494.1405690228748,"～",1518.3122340282976]
[null,null,310,930,920.2,990,{"$f":"F110+75*2-79.9*2","v":980.2},{"$f":"(($E110^2+H$106^2)^0.5)","v":921.06896593034776},"～",{"$f":"(($G110^2+J$106^2)^0.5)","v":981.01582046366616},{"$f":"(($E110^2+K$106^2)^0.5)","v":923.67095872935181},"～",{"$f":"(($G110^2+M$106^2)^0.5)","v":983.45922132033525},{"$f":"(($E110^2+N$106^2)^0.5)","v":927.99140082222743},"～",{"$f":"(($G110^2+P$106^2)^0.5)","v":987.51812135271723},{"$f":"(($E110^2+Q$106^2)^0.5)","v":934.00644537390644},"～",{"$f":"(($G110^2+S$106^2)^0.5)","v":993.17271408350723},941.6836199063888,"～",1000.3959416151188,950.98267071487692,"～",1009.1541210340471,961.8565589525291,"～",1019.4076907694978,974.25255452577596,"～",1031.1120404689298,988.11337406190387,"～",1044.2183871202421,{"$f":"(($E110^2+AI$106^2)^0.5)","v":1003.3783134989515},"～",{"$f":"(($G110^2+AK$106^2)^0.5)","v":1058.674662018507},{"$f":"(($E110^2+AL$106^2)^0.5)","v":1019.9843332130156},"～",{"$f":"(($G110^2+AN$106^2)^0.5)","v":1074.4263771892424},{"$f":"(($E110^2+AO$106^2)^0.5)","v":1037.8670627782731},"～",{"$f":"(($G110^2+AQ$106^2)^0.5)","v":1091.4174453434396},{"$f":"(($E110^2+AR$106^2)^0.5)","v":1056.9617022390169},"～",{"$f":"(($G110^2+AT$106^2)^0.5)","v":1109.5909336327511},{"$f":"(($E110^2+AU$106^2)^0.5)","v":1077.2038061574049},"～",{"$f":"(($G110^2+AW$106^2)^0.5)","v":1128.8897377512119},1098.5299449719157,"～",1149.2571687833843,1120.878244949022,"～",1170.6374502808289,1144.1888130898676,"～",1192.9761271710345,1168.4040568228099,"～",1216.2203912120533,1193.4689103617236,"～",1240.3193298501801,1219.330980497092,"～",1265.2241066309161,1245.9406245885075,"～",1290.8880819033075,1273.2509729036142,"～",1317.2668826020033,1301.2179064245927,"～",1344.3184295396682,1329.8,"～",1372.002930026026,1358.9584393939354,"～",1400.2828428571136,1388.6569194729129,"～",1429.1228218736135,1418.8615295369736,"～",1458.4896434325476,1449.5406306827001,"～",1488.3521223151463,1480.6647290997378,"～",1518.6810198326705,1512.2063483532927,"～",1549.4489472067157]
[null,null,320,960,950.2,1040,1030.2,{"$f":"(($E111^2+H$106^2)^0.5)","v":951.04155534866095},"～",{"$f":"(($G111^2+J$106^2)^0.5)","v":1030.9762557886579},{"$f":"(($E111^2+K$106^2)^0.5)","v":953.56176517307995},"～",{"$f":"(($G111^2+M$106^2)^0.5)","v":1033.3015242415934},{"$f":"(($E111^2+N$106^2)^0.5)","v":957.74737796560953},"～",{"$f":"(($G111^2+P$106^2)^0.5)","v":1037.1653870044063},{"$f":"(($E111^2+Q$106^2)^0.5)","v":963.57669129135752},"～",{"$f":"(($G111^2+S$106^2)^0.5)","v":1042.5507373744456},971.02010277851616,"～",1049.434152293511,980.04083588389312,"～",1057.7863867530154,990.59580051603291,"～",1067.5729670612684,1002.6365443170322,"～",1078.7548563042485,1016.110249923698,"～",1091.2891642456641,{"$f":"(($E111^2+AI$106^2)^0.5)","v":1030.9607364007613},"～",{"$f":"(($G111^2+AK$106^2)^0.5)","v":1105.129874720614},{"$f":"(($E111^2+AL$106^2)^0.5)","v":1047.1294284853234},"～",{"$f":"(($G111^2+AN$106^2)^0.5)","v":1120.2285659632146},{"$f":"(($E111^2+AO$106^2)^0.5)","v":1064.5562643655805},"～",{"$f":"(($G111^2+AQ$106^2)^0.5)","v":1136.5351028454863},{"$f":"(($E111^2+AR$106^2)^0.5)","v":1083.1805205043156},"～",{"$f":"(($G111^2+AT$106^2)^0.5)","v":1153.998284227494},{"$f":"(($E111^2+AU$106^2)^0.5)","v":1102.9415397019011},"～",{"$f":"(($G111^2+AW$106^2)^0.5)","v":1172.5664330859895},1123.779355567631,"～",1192.187921428497,1145.6352124476621,"～",1212.8116259337228,1168.451984464916,"～",1234.3873136094683,1192.1745006499677,"～",1256.8659594403853,1216.74978528866,"～",1280.2,1242.1272237576954,"～",1304.3435283697313,1268.2586644687274,"～",1329.2524365221227,1295.0984672989155,"～",1354.8845116835605,1322.60350823669,"～",1381.1994931942309,1350.7331490712738,"～",1408.1590961251502,1379.4491799265386,"～",1435.7270074773965,1408.7157413758107,"～",1463.8688602467093,1438.4992318385157,"～",1492.552190042278,1468.7682049935586,"～",1521.7463783429878,1499.4932610718863,"～",1551.4225858869015,1530.6469351225319,"～",1581.5536791395984]
[null,null,330,990,980.2,1090,1080.2,981.01582046366616,"～",1080.9403498806028,983.45922132033525,"～",1083.1583633061234,987.51812135271723,"～",1086.8449935478379,993.17271408350723,"～",1091.9853662023131,1000.3959416151188,"～",1098.5590744243116,1009.1541210340471,"～",1106.5405731377409,1019.4076907694978,"～",1115.8996549869528,1031.1120404689298,"～",1126.6019882815758,1044.2183871202421,"～",1138.6096960767547,1058.674662018507,"～",1151.8819557576201,1074.4263771892424,"～",1166.375599881959,1091.4174453434396,"～",1182.0457013161547,1109.5909336327511,"～",1198.8461285753065,1128.8897377512119,"～",1216.7300604489067,1149.2571687833843,"～",1235.6504521910717,1170.6374502808289,"～",1255.5604485647036,1192.9761271710345,"～",1276.4137416997671,1216.2203912120533,"～",1298.1648739663233,1240.3193298501801,"～",1320.7694878365414,1265.2241066309161,"～",1344.18452602312,1290.8880819033075,"～",1368.3683860715287,1317.2668826020033,"～",1393.281034106185,1344.3184295396682,"～",1418.8840826508697,1372.002930026026,"～",1445.140837427273,1400.2828428571136,"～",1472.016317844337,1429.1228218736135,"～",1499.4772555794236,1458.4896434325476,"～",1527.4920752658588,1488.3521223151463,"～",1556.0308608764801,1518.6810198326705,"～",1585.0653109572488,1549.4489472067157,"～",1614.5686854389317]
[null,null,340,1020,1010.2,1140,1130.2,1010.9916122302895,"～",1130.9076178008529,1013.3627386084413,"～",1133.0278196055028,1017.302334608547,"～",1136.5527000539835,1022.7922760756458,"～",1141.4692461910658,1029.8077684694363,"～",1147.7595741269163,1038.3178896657805,"～",1155.4012463209481,1048.2862395357481,"～",1164.3676567132909,1059.6716661305991,"～",1174.6284689211309,1072.4290372793903,"～",1186.1500916831731,1086.5100275653235,"～",1198.8961756549231,1101.8638935912186,"～",1212.8281164287048,1118.4382146547032,"～",1227.9055501136886,1136.1795808761924,"～",1244.0868297671188,1155.0342159434067,"～",1261.3294732146712,1174.94852653212,"～",1279.5905751450343,1195.8695748282921,"～",1298.8271786500311,1217.7454742268599,"～",1318.9966034831175,1240.5257111402407,"～",1340.0567301424221,1264.1613979235406,"～",1361.9662404039243,1288.6054632819155,"～",1384.6848161224273,1313.8127872722202,"～",1408.1732989941258,1339.7402882648562,"～",1432.3938145635786,1366.3469691114333,"～",1457.3098640989156,1393.5939293782819,"～",1482.886388095865,1421.4443499483193,"～",1509.0898051474603,1449.8634556398752,"～",1535.8880297730041,1478.8184607990258,"～",1563.2504725730935,1508.2785021341383,"～",1591.1480257977257,1538.2145624066884,"～",1619.5530371062257,1568.5993879891705,"～",1648.439273980088]
[null,null,350,1050,1040.2,1190,1180.2,1040.9687987639206,"～",1180.8776566605027,1043.2717958422916,"～",1182.9082973755826,1047.0988683023204,"～",1186.2849741946495,1052.4333898161917,"～",1190.9962384491398,1059.2525855526621,"～",1197.0263322082769,1067.5280043165144,"～",1204.3554458713591,1077.2260858334243,"～",1212.9600323176358,1088.3087980899538,"～",1222.8131664322232,1100.7343185346772,"～",1233.8849379095282,1114.4577336085922,"～",1246.1428650038486,1129.4317332180817,"～",1259.552317293728,1145.6072800048016,"～",1274.0769364524263,1162.9342371776661,"～",1289.6790453442284,1181.3619428439365,"～",1306.3200373568493,1200.8397228606323,"～",1323.960739599177,1221.3173379593036,"～",1342.5617453212349,1242.7453641032021,"～",1362.0837125522057,1265.0755076279045,"～",1382.4876274310741,1288.2608586773099,"～",1403.735031977189,1312.2560878121312,"～",1425.7882170925666,1337.0175915073071,"～",1448.6103824010099,1362.5035926558139,"～",1472.1657651229361,1388.6742022519177,"～",1496.4197405808304,1415.4914482256684,"～",1521.3388971560544,1442.919277021414,"～",1546.8910886032022,1470.9235330227061,"～",1573.0454666029204,1499.4719203773041,"～",1599.7724963256494,1528.5339512094588,"～",1627.0439576114716,1558.0808836514234,"～",1654.8329341658632,1588.0856526018993,"～",1683.1137929444938]
[null,null,360,1080,1070.2,1240,1230.2,1070.9472629406175,"～",1230.8501289759042,1073.1859298369504,"～",1232.7984587920282,1076.9066997655832,"～",1236.0388505221024,1082.0942842469874,"～",1240.5611794667766,1088.7277161898653,"～",1246.3514913538636,1096.7807620486421,"～",1253.3922131559618,1106.2224188652117,"～",1261.6624112653908,1117.0174752437852,"～",1271.1380884860621,1129.1271141904263,"～",1281.792510510184,1142.5095360652356,"～",1293.5965522526719,1157.1205814434379,"～",1306.5190545874177,1172.9143361729364,"～",1320.5271826054927,1189.8437040216668,"～",1335.5867774128344,1207.8609357041066,"～",1351.6626946098645,1226.9181064765489,"～",1368.7191238526625,1246.9675376688842,"～",1386.7198851967185,1267.9621603186745,"～",1405.6286991947768,1289.855821400206,"～",1425.4094289010438,1312.6035349640042,"～",1446.0262929836374,1336.1616818334523,"～",1467.4440500407502,1360.4881623887802,"～",1489.6281549433738,1385.5425074677428,"～",1512.5448885900873,1411.2859525978427,"～",1536.1614628677546,1437.6814807181736,"～",1560.4461028821213,1464.6938383157076,"～",1585.3681086738184,1492.289529548472,"～",1610.8978986888028,1520.4367925040488,"～",1637.0070372481605,1549.1055612836719,"～",1663.6682481793057,1578.2674171381732,"～",1690.8554166456693,1607.895531432313,"～",1718.5435810592642]
[null,null,370,1110,1100.2,1290,1280.2,1100.9269003889406,"～",1280.8247499170213,1103.1047275757637,"～",1282.6971739268781,1106.7249161377003,"～",1285.811821379785,1111.7733761877912,"～",1290.1596955416023,1118.2307633042476,"～",1295.7283820307402,1126.0728395623437,"～",1302.5022226468559,1135.2709103998041,"～",1310.4625290331655,1145.7923197508351,"～",1319.5878295892244,1157.6009847957112,"～",1329.854142378028,1170.6579517519197,"～",1341.2352664614809,1184.9219552358713,"～",1353.7030841362518,1200.3499656350227,"～",1367.2278668897882,1216.8977113956621,"～",1381.7785784994642,1234.5201658944256,"～",1397.3231694922974,1253.1719913882532,"～",1413.828858101291,1272.8079352361062,"～",1431.2623938328011,1293.3831760155224,"～",1449.590300740178,1314.8536192291522,"～",1468.7790984351595,1337.1761439690733,"～",1488.7954997245256,1360.3088031766904,"～",1509.6065845113421,1384.2109810285424,"～",1531.1799502344588,1408.8435115370337,"～",1553.4838396327141,1434.1687627333124,"～",1576.4872470147038,1460.1506908535159,"～",1600.16000449955,1486.7548688334605,"～",1624.4728498808468,1513.948493179342,"～",1649.3974778688125,1541.7003729648638,"～",1674.9065764991192,1569.98090434247,"～",1700.9738504750742,1598.7620335747281,"～",1727.5740331459026,1628.017211211233,"～",1754.6828887294707]
[null,null,380,{"$f":"C117*3","v":1140},1130.2,1340,1330.2,1130.9076178008529,"～",1330.8012774264985,1133.0278196055028,"～",1332.6034819105043,1136.5527000539835,"～",1335.6017520204143,1141.4692461910658,"～",1339.7880578658701,1147.7595741269163,"～",1345.1513074743673,1155.4012463209481,"～",1351.6774911198306,1164.3676567132909,"～",1359.3498593077502,1174.6284689211309,"～",1368.149129298411,1186.1500916831731,"～",1378.0537144828572,1198.8961756549231,"～",1389.0399706271955,1212.8281164287048,"～",1401.0824529627084,1227.9055501136886,"～",1414.1541782988163,1244.0868297671188,"～",1428.2268867375381,1261.3294732146712,"～",1443.2712981279715,1279.5905751450343,"～",1459.2573590700169,1298.8271786500311,"～",1476.1544770111291,1318.9966034831175,"～",1493.9317387350736,1340.0567301424221,"～",1512.5581112803568,1361.9662404039243,"～",1532.0026240186405,1384.6848161224273,"～",1552.2345312484192,1408.1732989941258,"～",1573.2234552027248,1432.3938145635786,"～",1594.9395098247458,1457.3098640989156,"～",1617.3534060309762,1482.886388095865,"～",1640.4365394613715,1509.0898051474603,"～",1664.1610619167845,1535.8880297730041,"～",1688.4999378146272,1563.2504725730935,"～",1713.4269870642286,1591.1480257977257,"～",1738.9169157840752,1619.5530371062257,"～",1764.9453362639874,1648.439273980088,"～",1791.4887775255529]
[null,null,390,1170,1160.2,1390,1380.2,1160.8893315040843,"～",1380.7795044828845,1162.9548744469839,"～",1382.5165604794759,1166.3893175093813,"～",1385.4068138998018,1171.1806180090243,"～",1389.4430682831162,1177.3122100785331,"～",1394.6153734990878,1184.7632843737183,"～",1400.9111463615386,1193.5091285784119,"～",1408.3153198059019,1203.5215162181355,"～",1416.8105166182245,1214.7691303288868,"～",1426.3772432284525,1227.2180083424462,"～",1436.9940988048629,1240.8319950742728,"～",1448.6379948075364,1255.5731918132053,"～",1461.2843802627879,1271.4023910627193,"～",1474.9074682840276,1288.2794883098932,"～",1489.480459757697,1306.1638641456898,"～",1504.9757606021435,1325.0147319935729,"～",1521.3651895583782,1344.7914485153451,"～",1538.6201740520628,1365.4537853768616,"～",1556.7119322469396,1386.9621624254933,"～",1575.6116399671589,1409.2778434361337,"～",1595.2905816809675,1432.3630964249253,"～",1615.7202851979052,1456.1813211272834,"～",1636.8726401281194,1480.6971466170926,"～",1658.7200004822996,1505.8765022404725,"～",1681.2352720544498,1531.6866650852583,"～",1704.3919854305816,1558.0962871401755,"～",1728.164355609732,1585.0754051463923,"～",1752.5273293161508,1612.5954359354985,"～",1777.4566211303161,1640.6291598042503,"～",1802.9287395790218,1669.1506942154745,"～",1828.921004308278]
[null,null,400,{"$f":"C119*3","v":1200},1190.2,1440,1430.2,1190.8719662499407,"～",1430.7592529842329,1192.8855938437684,"～",1432.4357018728624,1196.2341075224365,"～",1435.225431770215,1200.9063410607839,"～",1439.1219684238024,1206.8869209665006,"～",1444.1163526530679,1214.156513798777,"～",1450.1972417571342,1222.6921280518657,"～",1457.3510352691283,1232.4674600166936,"～",1465.5620218878489,1243.4532721417399,"～",1474.8125440204258,1255.6177921644787,"～",1485.0831761217955,1268.9271216267703,"～",1496.352912918607,1283.3456432310043,"～",1508.5993636482815,1298.8364177216467,"～",1521.798948613121,1315.3615624610595,"～",1535.9270946239603,1332.8826054833187,"～",1550.9584262642245,1351.3608104425703,"～",1566.8669503183735,1370.7574694306795,"～",1583.6262311543087,1391.0341620535421,"～",1601.2095553049887,1412.1529803813751,"～",1619.5900839409953,1434.0767204023639,"～",1638.7409923474791,1456.7690414063584,"～",1658.6355959040552,1480.1945953150889,"～",1679.2474624068961,1504.3191283766885,"～",1700.5505108640555,1529.10955788001,"～",1722.5190971365166,1554.534026645927,"～",1745.1280869896054,1580.5619380460862,"～",1768.3529172651029,1607.1639742104724,"～",1792.1696459877899,1634.3120999368512,"～",1816.5549922862231,1661.9795546275532,"～",1841.4863670415809,1690.1408343685446,"～",1866.9418951858142]
[null,null,410,{"$f":"C120*3","v":1230},1220.2,1490,{"$f":"F120+75*2-79.9*2","v":1480.2},{"$f":"(($E120^2+H$106^2)^0.5)","v":1220.8554541795684},"～",{"$f":"(($G120^2+J$106^2)^0.5)","v":1480.7403688695733},{"$f":"(($E120^2+K$106^2)^0.5)","v":1222.819708706071},"～",{"$f":"(($G120^2+M$106^2)^0.5)","v":1482.3602935858744},{"$f":"(($E120^2+N$106^2)^0.5)","v":1226.0864732962355},"～",{"$f":"(($G120^2+P$106^2)^0.5)","v":1485.0562413592288},{"$f":"(($E120^2+Q$106^2)^0.5)","v":1230.6453754026786},"～",{"$f":"(($G120^2+S$106^2)^0.5)","v":1488.8223668389726},1236.4821227983848,"～",1493.6505749337762,1243.5787228800596,"～",1499.5306065565985,1251.913751022809,"～",1506.450145208928,1261.4626589796464,"～",1514.394941882731,1272.1981135027672,"～",1523.3489554268253,{"$f":"(($E120^2+AI$106^2)^0.5)","v":1284.0903550763085},"～",{"$f":"(($G120^2+AK$106^2)^0.5)","v":1533.2945053054875},{"$f":"(($E120^2+AL$106^2)^0.5)","v":1297.1075668578917},"～",{"$f":"(($G120^2+AN$106^2)^0.5)","v":1544.2124335725316},{"$f":"(($E120^2+AO$106^2)^0.5)","v":1311.2162445607514},"～",{"$f":"(($G120^2+AQ$106^2)^0.5)","v":1556.082272889194},{"$f":"(($E120^2+AR$106^2)^0.5)","v":1326.381558979165},"～",{"$f":"(($G120^2+AT$106^2)^0.5)","v":1568.8824175189166},{"$f":"(($E120^2+AU$106^2)^0.5)","v":1342.5677040656087},"～",{"$f":"(($G120^2+AW$106^2)^0.5)","v":1582.5902944224067},1359.7382248065251,"～",1597.1825318353567,1377.8563205211203,"～",1612.6351230207038,1396.8851205449932,"～",1628.9235832291213,1416.7879304963039,"～",1646.0230982583446,1437.5284484141523,"～",1663.9086633586592,1459.0709509821652,"～",1682.555211575537,1481.3804507958109,"～",1701.9377309408239,1504.4228262027932,"～",1722.0313702136789,1528.164925654296,"～",1742.8115331268611,1552.574648768941,"～",1764.2539613105591,1577.6210064524369,"～",1786.334806244339,1603.2741624563155,"～",1809.030690729154,1629.5054587205284,"～",1832.3187604780999,1656.2874267469399,"～",1856.1767264999312,1683.5937871113686,"～",1880.5828989970105,1711.399439055652,"～",1905.5162135232542]
[null,null,420,1260,1250.2,1540,1530.2,1250.8397339387648,"～",1530.7227181955589,1252.7569756341411,"～",1532.2898028767274,1255.945874629954,"～",1534.8980552466669,1260.3967787962647,"～",1538.5421801172693,1266.0963786378982,"～",1543.2148392236254,1273.0279022865132,"～",1548.9067241122043,1281.1713546594772,"～",1555.6066469387433,1290.5037930978738,"～",1563.301647155788,1300.9996310529839,"～",1571.9771117926623,1312.6309610854073,"～",1581.6169068393269,1325.3678885501943,"～",1592.2035171422026,1339.1788678141543,"～",1603.7181922021089,1354.0310336177677,"～",1616.1410953255288,1369.8905211731337,"～",1629.4514537107266,1386.7227696983994,"～",1643.6277072378648,1404.4928052503508,"～",1658.6476539639152,1423.1654998628937,"～",1674.4885905851972,1442.7058050760038,"～",1691.127446409643,1463.0789589082333,"～",1708.5409096653202,1484.2506661612115,"～",1726.7055452508398,1506.1872526349439,"～",1745.5979032984658,1528.8557943769583,"～",1765.1946181653739,1552.2242234935004,"～",1785.472497687937,1576.2614123298204,"～",1806.4086027253081,1600.9372379952938,"～",1827.9803171806857,1626.2226292854248,"～",1850.1654088216005,1652.0895980545365,"～",1872.9420813255279,1678.5112570370209,"～",1896.2890180560557,1705.4618260166365,"～",1920.1854181302388,1732.9166281157325,"～",1944.6110253724264]
[null,null,430,1290,1280.2,1590,1580.2,1280.8247499170213,"～",1580.7061839570313,1282.6971739268781,"～",1582.2237642002474,1285.811821379785,"～",1584.749835147491,1290.1596955416023,"～",1588.2795849597765,1295.7283820307402,"～",1592.8063410220341,1302.5022226468559,"～",1598.3216322129911,1310.4625290331655,"～",1604.8152666272838,1319.5878295892244,"～",1612.2754231210001,1329.854142378028,"～",1620.6887548199993,1341.2352664614809,"～",1630.0405025642767,1353.7030841362518,"～",1640.3146161636189,1367.2278668897882,"～",1651.4938813086774,1381.7785784994642,"～",1663.5600500132239,1397.3231694922974,"～",1676.4939725510499,1413.828858101291,"～",1690.2757289862504,1431.2623938328011,"～",1704.8847585687427,1449.590300740178,"～",1720.2999854676509,1468.7790984351595,"～",1736.4999395335435,1488.7954997245256,"～",1753.4628710069683,1509.6065845113421,"～",1771.1668583168555,1531.1799502344588,"～",1789.5899083309562,1553.4838396327141,"～",1808.7100486258155,1576.4872470147038,"～",1828.5054115315054,1600.16000449955,"～",1848.9543098735567,1624.4728498808468,"～",1870.0353044795704,1649.3974778688125,"～",1891.7272636402954,1674.9065764991192,"～",1914.0094148148801,1700.9738504750742,"～",1936.8613889486257,1727.5740331459026,"～",1960.2632578304374,1754.6828887294707,"～",1984.1955649582528]
[null,null,440,1320,1310.2,1640,1630.2,1310.8104515909233,"～",1630.6906634920065,1312.6401029985332,"～",1632.1617689432626,1315.6838678041165,"～",1634.6106692420676,1319.933346802027,"～",1638.0329789109865,{"$f":"(($E123^2+T$106^2)^0.5)","v":1325.3769426091583},"～",{"$f":"(($G123^2+V$106^2)^0.5)","v":1642.4226130932318},1332.0000150150149,"～",1647.7718410022669,1339.7850723157055,"～",1654.0713527535625,1348.7119929770033,"～",1661.3103382571242,1358.7582713639686,"～",1669.4765766550904,1369.8992809692252,"～",1678.5565346451694,1382.1085485590486,"～",1688.5354719401071,1395.3580329076835,"～",1699.3975520754407,1409.6184022635346,"～",1711.125956789856,1424.8593053350917,"～",1723.7030022599602,{"$f":"(($E123^2+AX$106^2)^0.5)","v":1441.0496313451526},"～",{"$f":"(($G123^2+AZ$106^2)^0.5)","v":1737.1102555681375},1458.1577555257868,"～",1751.328649911261,1476.1517672651414,"～",1766.3385972117578,1494.9996789297313,"～",1782.1200969631648,1514.6696141403247,"～",1798.6528403224454,1535.1299749532611,"～",1815.9163086442063,1556.3495879782281,"～",1833.8898658316425,1578.2978299421184,"～",1852.5528440506091,1600.9447335870154,"～",1871.88462251283,1624.2610750738318,"～",1891.8646991790929,1648.2184442603475,"～",1912.472755361498,1672.7892993440626,"～",1933.6887133145294,1697.9470074180761,"～",1955.4927869976918,1723.6658724938543,"～",1977.8655262681536,1749.9211525094495,"～",2000.7878548211952,1776.6890667756134,"～",2024.2411022405408]
[null,null,450,1350,1340.2,1690,1680.2,1340.7967929555919,"～",1680.6760663494913,1342.5855801400521,"～",1682.1034569847361,1345.5616076568178,"～",1684.4797535144196,1349.7170221939116,"～",1687.8009479793523,1355.0409735502465,"～",1692.0614764245418,1361.5197538045491,"～",1697.254264982121,1369.1369690429078,"～",1703.3707875856037,1377.8737387728963,"～",1710.4011342372291,1387.7089176048412,"～",1718.3340885869663,1398.6193334857057,"～",1727.157213457999,1410.5800367224824,"～",1736.8569428712315,1423.5645542089055,"～",1747.4186790806605,1437.5451436389747,"～",1758.8268931307596,1452.4930430125992,"～",1771.0652274831664,1468.3787113684261,"～",1784.1165993286425,1485.1720573724783,"～",1797.9633032962604,1502.8426531077696,"～",1812.5871123893605,1521.3599311142646,"～",1827.9693761110989,1540.6933633919502,"～",1844.091114885596,1560.8126216814112,"～",1860.9331100284073,1581.687718862355,"～",1878.4759886674092,1603.2891317538456,"～",1896.7003031580925,1625.5879059589488,"～",1915.5866046723129,1648.5557436738377,"～",1935.1155107641507,1672.1650755831495,"～",1955.2677668288811,1696.3891180976138,"～",1976.0243014699997,1721.2019172659552,"～",1997.3662758743073,1746.5783807204302,"～",2019.2751273662536,1772.4942990035256,"～",2041.7326073705146,1798.926357581099,"～",2064.7208140569514]
[null,null,460,1380,1370.2,1740,1730.2,1370.7837320306949,"～",1730.6623125266235,1372.5334385726273,"～",1732.0485097132816,1375.4446699158784,"～",1734.3563762964059,1379.5100724532606,"～",1737.582239780322,1384.7194806169227,"～",1741.7209994714997,1391.0600418385973,"～",1746.7661663771714,1398.516371016085,"～",1752.7099132486244,1407.0707302762005,"～",1759.5431338844751,1416.7032293320997,"～",1767.2555106718439,1427.392041451822,"～",1775.8355892367965,1439.1136299820109,"～",1785.2708590015129,1451.8429804906591,"～",1795.5478384047583,1465.5538338798749,"～",1806.6521635334236,1480.2189162417835,"～",1818.5686789340677,1495.810161751818,"～",1831.2815294214049,1512.2989254773674,"～",1844.7742517717445,1529.6561835915938,"～",1859.0298652791998,1547.8527190918392,"～",1874.0309602565269,1566.8592917042679,"～",1889.7597836762216,1586.6467911920411,"～",1906.1983212667039,1607.1863737600565,"～",1923.3283754990982,1628.4495816573506,"～",1941.1316390188483,1650.4084464156138,"～",1959.5897631902449,1673.0355764298617,"～",1978.6844215286076,1696.3042297889845,"～",1998.397367892582,1720.1883734056571,"～",2018.7104893966346,1744.6627295841452,"～",2039.6058540806359,1769.7028112087069,"～",2061.0657534392249,1795.2849467424385,"～",2083.0727399685302,1821.3862962040755,"～",2105.6096599322486]
[null,null,470,1410,1400.2,1790,1780.2,1400.7712304298657,"～",1780.649331002598,1402.4835257499462,"～",1781.9966442168179,1405.3327150536275,"～",1784.2399053938907,1409.3119030221806,"～",1787.37574113559,1414.4115525546304,"～",1791.3994641062054,1420.619597218059,"～",1796.3051077141656,1427.9215804798246,"～",1802.0854696711808,1436.3008180739855,"～",1808.7321636992028,1445.7385794119211,"～",1816.2356785395446,1456.2142836821783,"～",1824.5854433267848,1467.7057061958981,"～",1833.7698983242144,1480.1891906104436,"～",1843.7765699780437,1493.639862885294,"～",1854.5921492338955,1508.0318431651235,"～",1866.2025720698168,1523.3384522160529,"～",1878.5931012329413,1539.532409532193,"～",1891.7484082192325,1556.5860207518247,"～",1905.652654604191,1574.4713525498012,"～",1920.2895719135695,1593.1603936829463,"～",1935.6425393134964,1612.6252013409687,"～",1951.6946584955342,1632.8380323841063,"～",1968.4288252309252,1653.7714594223714,"～",1985.827797166713,1675.3984720059882,"～",2003.8742575321437,1697.6925634519343,"～",2022.550874514656,1720.6278040296804,"～",2041.8403561493244,1744.1789013745122,"～",2061.7255006426049,1768.3212490947453,"～",2082.1892421199377,1793.0309645959826,"～",2103.2146918467452,1818.2849171678238,"～",2124.7851750235836,1844.0607473724938,"～",2146.8842632987926]
[null,null,480,{"$f":"C127*3","v":1440},1430.2,1840,1830.2,1430.7592529842329,"～",1830.6370585126917,1432.4357018728624,"～",1831.9476084211578,1435.225431770215,"～",1834.1297773058482,1439.1219684238024,"～",1837.1804592908122,1444.1163526530679,"～",1841.0953370208724,1450.1972417571342,"～",1845.8689119219707,1457.3510352691283,"～",1851.4945422549861,1465.5620218878489,"～",1857.9644883581602,1474.8125440204258,"～",1865.2699643751303,1485.0831761217955,"～",1873.4011956866048,1496.352912918607,"～",1882.3474812053166,1508.5993636482815,"～",1892.097259656596,1521.798948613121,"～",1902.6381789504803,1535.9270946239603,"～",1913.9571677548063,1550.9584262642245,"～",1926.0405084005893,1566.8669503183735,"～",1938.8739102891657,1583.6262311543087,"～",1952.4425830226096,1601.2095553049887,"～",1966.7313085421711,1619.5900839409953,"～",1981.7245116312206,1638.7409923474791,"～",1997.4063282166701,1658.6355959040552,"～",2013.7606709835209,1679.2474624068961,"～",2030.7712918987208,1700.5505108640555,"～",2048.4218413207764,1722.5190971365166,"～",2066.6959234488272,1745.1280869896054,"～",2085.5771479377117,1768.3529172651029,"～",2105.0491775728187,1792.1696459877899,"～",2125.0957719594662,1816.5549922862231,"～",2145.7008272357075,1841.4863670415809,"～",2166.8484118645679,1866.9418951858142,"～",2188.5227986018331]
[null,null,490,{"$f":"C128*3","v":1470},1460.2,1890,1880.2,1460.7477674122936,"～",1880.625438517729,1462.3898385861412,"～",1881.9011770015979,1465.1225341247059,"～",1884.0254881503063,1468.9397673151884,"～",1886.9955060889786,1473.8331113121324,"～",1890.8072455964411,1479.7918907738344,"～",1895.455628602263,1486.8032956648974,"～",1900.9345175465671,1494.8525144642197,"～",1907.2367550988524,1503.9228836612601,"～",1914.3542096487786,1513.9960501929984,"～",1922.2778259138297,1525.0521433708423,"～",1930.9976799571771,1537.0699528648656,"～",1940.503037874458,1550.0271094403479,"～",1950.7824173905199,1563.9002653622128,"～",1961.8236516058216,1578.6652716773117,"～",1973.6139541460484,1594.2973499319378,"～",1986.1399849960223,1610.7712562620429,"～",1999.3879163383979,1628.0614361872219,"～",2013.3434977668367,1646.1421688298979,"～",2027.9921203002737,1664.9876996542648,"～",2043.3188786873184,1684.5723611646963,"～",2059.3086315557462,1704.8706813128085,"～",2075.946059029473,1725.857479631502,"～",2093.2157175026182,1747.5079513409946,"～",2111.1020913257607,1769.7977398561679,"～",2129.589641221989,1792.7029982682575,"～",2148.6628493088442,1816.20044048007,"～",2168.3062606559988,1840.2673827463225,"～",2188.5045213569929,1864.8817764137223,"～",2209.2424131362318,1890.0222326734679,"～",2230.504884549684]
[null,null,500,{"$f":"C129*3","v":1500},1490.2,1940,{"$f":"F129+75*2-79.9*2","v":1930.2},1490.7367440296091,"～",1930.6144203335891,1492.3458178317785,"～",1931.8571479278689,1495.0237590085317,"～",1933.9265859902748,1498.7648381250476,"～",1936.8200845716156,1503.5611194760259,"～",1940.5339574457334,1509.4025440550972,"～",1945.0635053899912,1516.2770327351134,"～",1950.4030455267446,1524.1706072484144,"～",1956.5459463043539,1533.067526236206,"～",1963.4846676253931,1542.9504334229275,"～",1971.2108055710328,1553.800514866693,"～",1979.7151411251064,1565.5976622363742,"～",1988.9876922696128,1578.3206391604972,"～",1999.01776880547,1591.9472478697276,"～",2009.7940292477736,1606.4544935976244,"～",2021.304539152871,1621.8187444964371,"～",2033.5368302541265,1638.0158851488591,"～",2046.4779598129076,1655.0214620964889,"～",2060.114569629563,1672.8108201467373,"～",2074.4329442042708,1691.3592285496302,"～",2089.4190675879263,1710.6419964446097,"～",2105.0586785170622,1730.6345772577179,"～",2121.3373234825244,1751.3126619767243,"～",2138.2404074378542,1772.6522614432872,"～",2155.7532419087302,1794.629777976505,"～",2173.8610903183303,1817.222066782153,"～",2192.5492103941474,1840.4064877086257,"～",2211.8028935689545,1864.1609479870563,"～",2231.6075013317195,1888.4639366426884,"～",2251.9484985230015,1913.2945512910446,"～",2272.8114836035124]
[]
[null,"【４段飛ばして連結】",null,null,"不可　踏面最小280×4＝1120の為"]

{"sheet":"固定数値","index":4,"n_rows":15,"n_cols":8,"rows_kept":15,"cut":false,"hidden":true,"merged":[]}
[]
["上段","下段","連結バー","①","楽起","⑤","楽起","ベースサイズ"]
["シングル","シングル","ウェーブ",123.084,"シングル",10,"シングル",49.5]
["ダブル","ダブル",1200,108.5,"ダブル",10,"ダブル",49.5]
["ロング","ロング","ウェーブS",95.903999999999996,"ロング",10.25,"ロング",79.5]
["ショート","ショート",900,78.5,"ショート",7.5,"ショート",28]
["ショートダブル","ショートダブル",600,48.5,"ショートダブル",7.5,"ショートダブル",28]
["横型","スリム",null,null,"スリム",15.25,"スリム",30.5]
["縦型","横型",null,null,"横型",10.25,"横型",50]
["波型","縦型",null,null,"縦型",10.25,"縦型",50]
["ワイド縦型","介助バー型",null,null,"介助バー型",10.25,"介助バー型",50]
[null,"波型",null,null,"波型",10.25,"波型",50]
[null,"ワイド縦型",null,null,"ワイド縦型",10.5,"ワイド縦型",80]
[null,"ワイド介助バー型",null,null,"ワイド介助バー型",10.5,"ワイド介助バー型",80]
[null,"狭所用波型",null,null,"狭所用波型",10.25,"狭所用波型",50]